BDBM50215715 (2S,3R)-1-(3-chloro-4-cyano-2-methyl-phenylsulfamoyl)-3-hydroxy-pyrrolidine-2-carboxylic acid::CHEMBL393048
SMILES: Cc1c(Cl)c(ccc1NS(=O)(=O)N1CC[C@@H](O)[C@H]1C(O)=O)C#N
InChI Key: InChIKey=NKZVQILFXGAMOQ-PWSUYJOCSA-N
Data: 1 EC50
Activity Spreadsheet -- Enzyme Inhibition Constant Data from BindingDB
Found 1 hit for monomerid = 50215715
Trg + Lig
Ki
nM
ΔG°
kcal/mole
IC50
nM
Kd
nM
EC50/IC50
nM
koff
s-1
kon
M-1s-1
pHTemp
°C
Androgen Receptor
(Mus musculus)
BDBM50215715
((2S,3R)-1-(3-chloro-4-cyano-2-methyl-phenylsulfamo...)
Show SMILES Cc1c(Cl)c(ccc1NS(=O)(=O)N1CC[C@@H](O)[C@H]1C(O)=O)C#N
Show InChI InChI=1S/C13H14ClN3O5S/c1-7-9(3-2-8(6-15)11(7)14)16-23(21,22)17-5-4-10(18)12(17)13(19)20/h2-3,10,12,16,18H,4-5H2,1H3,(H,19,20)/t10-,12+/m1/s1
Reactome pathway
n/an/an/an/a 2.80n/an/an/an/a
Bristol-Myers Squibb Research and Development
Curated by ChEMBL
Assay Description
Agonist activity at androgen receptor in mouse C2C12 cells by receptor transactivation assay
Bioorg Med Chem Lett 17: 4487-90 (2007)
Article DOI: 10.1016/j.bmcl.2007.06.007
BindingDB Entry DOI: 10.7270/Q2NV9HZ9