BDBM50215717 (2S,3R)-1-(3-chloro-4-cyano-2-methyl-phenylsulfamoyl)-3-hydroxy-pyrrolidine-2-carboxylic acid methyl ester::CHEMBL234187
SMILES: COC(=O)[C@@H]1[C@H](O)CCN1S(=O)(=O)Nc1ccc(C#N)c(Cl)c1C
InChI Key: InChIKey=GAWBUFHNXCHJCS-YPMHNXCESA-N
Data: 1 EC50
Activity Spreadsheet -- Enzyme Inhibition Constant Data from BindingDB
Found 1 hit for monomerid = 50215717
Trg + Lig
Ki
nM
ΔG°
kcal/mole
IC50
nM
Kd
nM
EC50/IC50
nM
koff
s-1
kon
M-1s-1
pHTemp
°C
Androgen Receptor
(Mus musculus)
BDBM50215717
((2S,3R)-1-(3-chloro-4-cyano-2-methyl-phenylsulfamo...)
Show SMILES COC(=O)[C@@H]1[C@H](O)CCN1S(=O)(=O)Nc1ccc(C#N)c(Cl)c1C
Show InChI InChI=1S/C14H16ClN3O5S/c1-8-10(4-3-9(7-16)12(8)15)17-24(21,22)18-6-5-11(19)13(18)14(20)23-2/h3-4,11,13,17,19H,5-6H2,1-2H3/t11-,13+/m1/s1
Reactome pathway
n/an/an/an/a 7.46E+3n/an/an/an/a
Bristol-Myers Squibb Research and Development
Curated by ChEMBL
Assay Description
Agonist activity at androgen receptor in mouse C2C12 cells by receptor transactivation assay
Bioorg Med Chem Lett 17: 4487-90 (2007)
Article DOI: 10.1016/j.bmcl.2007.06.007
BindingDB Entry DOI: 10.7270/Q2NV9HZ9