BDBM50215759 CHEMBL247423::N-(2,2-difluorobenzo[d][1,3]dioxol-5-yl)-2-((2-(2-(2-hydroxyethoxy)ethylamino)pyridin-4-yl)methylamino)benzamide
SMILES: OCCOCCNc1cc(CNc2ccccc2C(=O)Nc2ccc3OC(F)(F)Oc3c2)ccn1
InChI Key: InChIKey=IDFVXZZDQOMMGE-UHFFFAOYSA-N
Data: 2 IC50
Activity Spreadsheet -- Enzyme Inhibition Constant Data from BindingDB
Found 2 hits for monomerid = 50215759
Trg + Lig
Ki
nM
ΔG°
kcal/mole
IC50
nM
Kd
nM
EC50/IC50
nM
koff
s-1
kon
M-1s-1
pHTemp
°C
Serine/threonine-protein kinase B-raf
(Homo sapiens (Human))
BDBM50215759
(CHEMBL247423 | N-(2,2-difluorobenzo[d][1,3]dioxol-...)
Show SMILES OCCOCCNc1cc(CNc2ccccc2C(=O)Nc2ccc3OC(F)(F)Oc3c2)ccn1
Show InChI InChI=1S/C24H24F2N4O5/c25-24(26)34-20-6-5-17(14-21(20)35-24)30-23(32)18-3-1-2-4-19(18)29-15-16-7-8-27-22(13-16)28-9-11-33-12-10-31/h1-8,13-14,29,31H,9-12,15H2,(H,27,28)(H,30,32)
NCI pathway
Reactome pathway
n/an/a 165n/an/an/an/an/an/a
Bayer Research Center
Curated by ChEMBL
Assay Description
Inhibition of b-Raf
Bioorg Med Chem Lett 17: 4378-81 (2007)
Article DOI: 10.1016/j.bmcl.2007.02.075
BindingDB Entry DOI: 10.7270/Q28K78S7
Mast/stem cell growth factor receptor Kit
(Homo sapiens (Human))
BDBM50215759
(CHEMBL247423 | N-(2,2-difluorobenzo[d][1,3]dioxol-...)
Show SMILES OCCOCCNc1cc(CNc2ccccc2C(=O)Nc2ccc3OC(F)(F)Oc3c2)ccn1
Show InChI InChI=1S/C24H24F2N4O5/c25-24(26)34-20-6-5-17(14-21(20)35-24)30-23(32)18-3-1-2-4-19(18)29-15-16-7-8-27-22(13-16)28-9-11-33-12-10-31/h1-8,13-14,29,31H,9-12,15H2,(H,27,28)(H,30,32)
n/an/a 4n/an/an/an/an/an/a
Bayer Research Center
Curated by ChEMBL
Assay Description
Inhibition of human recombinant cKit by FRET assay
Bioorg Med Chem Lett 17: 4378-81 (2007)
Article DOI: 10.1016/j.bmcl.2007.02.075
BindingDB Entry DOI: 10.7270/Q28K78S7