BDBM50215777 4-((4-((2,2-difluorobenzo[d][1,3]dioxol-5-yl)carbamoyl)-1-methyl-1H-pyrazol-5-ylamino)methyl)-N-methylpicolinamide::CHEMBL247435
SMILES: CNC(=O)c1cc(CNc2c(cnn2C)C(=O)Nc2ccc3OC(F)(F)Oc3c2)ccn1
InChI Key: InChIKey=FJYFVYKYNSQZCC-UHFFFAOYSA-N
Data: 2 IC50
Activity Spreadsheet -- Enzyme Inhibition Constant Data from BindingDB
Found 2 hits for monomerid = 50215777
Trg + Lig
Ki
nM
ΔG°
kcal/mole
IC50
nM
Kd
nM
EC50/IC50
nM
koff
s-1
kon
M-1s-1
pHTemp
°C
Mast/stem cell growth factor receptor Kit
(Homo sapiens (Human))
BDBM50215777
(4-((4-((2,2-difluorobenzo[d][1,3]dioxol-5-yl)carba...)
Show SMILES CNC(=O)c1cc(CNc2c(cnn2C)C(=O)Nc2ccc3OC(F)(F)Oc3c2)ccn1
Show InChI InChI=1S/C20H18F2N6O4/c1-23-19(30)14-7-11(5-6-24-14)9-25-17-13(10-26-28(17)2)18(29)27-12-3-4-15-16(8-12)32-20(21,22)31-15/h3-8,10,25H,9H2,1-2H3,(H,23,30)(H,27,29)
n/an/a 11n/an/an/an/an/an/a
Bayer Research Center
Curated by ChEMBL
Assay Description
Inhibition of human recombinant cKit by FRET assay
Bioorg Med Chem Lett 17: 4378-81 (2007)
Article DOI: 10.1016/j.bmcl.2007.02.075
BindingDB Entry DOI: 10.7270/Q28K78S7
Serine/threonine-protein kinase B-raf
(Homo sapiens (Human))
BDBM50215777
(4-((4-((2,2-difluorobenzo[d][1,3]dioxol-5-yl)carba...)
Show SMILES CNC(=O)c1cc(CNc2c(cnn2C)C(=O)Nc2ccc3OC(F)(F)Oc3c2)ccn1
Show InChI InChI=1S/C20H18F2N6O4/c1-23-19(30)14-7-11(5-6-24-14)9-25-17-13(10-26-28(17)2)18(29)27-12-3-4-15-16(8-12)32-20(21,22)31-15/h3-8,10,25H,9H2,1-2H3,(H,23,30)(H,27,29)
NCI pathway
Reactome pathway
n/an/a 199n/an/an/an/an/an/a
Bayer Research Center
Curated by ChEMBL
Assay Description
Inhibition of b-Raf
Bioorg Med Chem Lett 17: 4378-81 (2007)
Article DOI: 10.1016/j.bmcl.2007.02.075
BindingDB Entry DOI: 10.7270/Q28K78S7