BDBM50215882 CHEMBL298394::Ro-092183
SMILES: CCc1ccc(CC[C@@H]2CCC(C)(C)\C(=N\OC)[C@H]2Cn2cncn2)cc1
InChI Key: InChIKey=UEZRAWYLSFCAHI-VTWZHPSESA-N
Data: 1 IC50
Activity Spreadsheet -- Enzyme Inhibition Constant Data from BindingDB
Found 1 hit for monomerid = 50215882
Trg + Lig
Ki
nM
ΔG°
kcal/mole
IC50
nM
Kd
nM
EC50/IC50
nM
koff
s-1
kon
M-1s-1
pHTemp
°C
Lanosterol 14-alpha demethylase
(Homo sapiens (Human))
BDBM50215882
(CHEMBL298394 | Ro-092183)
Show SMILES CCc1ccc(CC[C@@H]2CCC(C)(C)\C(=N\OC)[C@H]2Cn2cncn2)cc1
Show InChI InChI=1S/C22H32N4O/c1-5-17-6-8-18(9-7-17)10-11-19-12-13-22(2,3)21(25-27-4)20(19)14-26-16-23-15-24-26/h6-9,15-16,19-20H,5,10-14H2,1-4H3/b25-21+/t19-,20+/m1/s1
n/an/a 0.0320n/an/an/an/an/an/a
Nippon Roche Research Center
Curated by ChEMBL
Assay Description
In vitro inhibition of cytochrome P450 lanosterol C14 demethylase in Candida albicans CY1005
Bioorg Med Chem Lett 8: 1819-24 (1998)
BindingDB Entry DOI: 10.7270/Q2H997D2