BDBM50216206 CHEMBL393989::N-(2-methoxyphenethyl)-4-(benzyloxy)-N-(pyrrolidin-3-yl)benzamide
SMILES: COc1ccccc1CCN(C1CCNC1)C(=O)c1ccc(OCc2ccccc2)cc1
InChI Key: InChIKey=HANVMPYHKVVYQL-UHFFFAOYSA-N
Data: 1 IC50
Activity Spreadsheet -- Enzyme Inhibition Constant Data from BindingDB
Found 1 hit for monomerid = 50216206
Trg + Lig
Ki
nM
ΔG°
kcal/mole
IC50
nM
Kd
nM
EC50/IC50
nM
koff
s-1
kon
M-1s-1
pHTemp
°C
Membrane-bound transcription factor site-1 protease
(Homo sapiens (Human))
BDBM50216206
(CHEMBL393989 | N-(2-methoxyphenethyl)-4-(benzyloxy...)
Show SMILES COc1ccccc1CCN(C1CCNC1)C(=O)c1ccc(OCc2ccccc2)cc1 |w:11.11|
Show InChI InChI=1S/C27H30N2O3/c1-31-26-10-6-5-9-22(26)16-18-29(24-15-17-28-19-24)27(30)23-11-13-25(14-12-23)32-20-21-7-3-2-4-8-21/h2-14,24,28H,15-20H2,1H3
Reactome pathway
n/an/a 310n/an/an/an/an/an/a
Pfizer Global Research and Development-Groton Laboratories
Curated by ChEMBL
Assay Description
Inhibition of human S1P expressed in CHOK1 cells
Bioorg Med Chem Lett 17: 4411-4 (2007)
Article DOI: 10.1016/j.bmcl.2007.06.031
BindingDB Entry DOI: 10.7270/Q26M36JG