BDBM50216657 CHEMBL391392::tert-butyl (R)-1-((R)-1-isopropyl-2-oxo-2,3,4,5-tetrahydro-1H-benzo[b]azepin-3-ylamino)-1-oxo-3-phenylpropan-2-ylcarbamate
SMILES: CC(C)N1c2ccccc2CC[C@@H](NC(=O)[C@@H](Cc2ccccc2)NC(=O)OC(C)(C)C)C1=O
InChI Key: InChIKey=CMBXSZAUCLZFJC-FGZHOGPDSA-N
Data: 1 IC50
Activity Spreadsheet -- Enzyme Inhibition Constant Data from BindingDB
Found 1 hit for monomerid = 50216657
Trg + Lig
Ki
nM
ΔG°
kcal/mole
IC50
nM
Kd
nM
EC50/IC50
nM
koff
s-1
kon
M-1s-1
pHTemp
°C
Sodium channel protein type 9 subunit alpha
(Homo sapiens (Human))
BDBM50216657
(CHEMBL391392 | tert-butyl (R)-1-((R)-1-isopropyl-2...)
Show SMILES CC(C)N1c2ccccc2CC[C@@H](NC(=O)[C@@H](Cc2ccccc2)NC(=O)OC(C)(C)C)C1=O
Show InChI InChI=1S/C27H35N3O4/c1-18(2)30-23-14-10-9-13-20(23)15-16-21(25(30)32)28-24(31)22(17-19-11-7-6-8-12-19)29-26(33)34-27(3,4)5/h6-14,18,21-22H,15-17H2,1-5H3,(H,28,31)(H,29,33)/t21-,22-/m1/s1
n/an/a 45n/an/an/an/an/an/a
Merck Research Laboratories
Curated by ChEMBL
Assay Description
Blockade of human Nav1.7 by FRET assay
Bioorg Med Chem Lett 17: 4630-4 (2007)
Article DOI: 10.1016/j.bmcl.2007.05.076
BindingDB Entry DOI: 10.7270/Q2HX1CCF