BDBM50216729 CHEMBL422519
SMILES: OC(=O)C(F)(F)F.NCCCNCCCCNCCCNC(=O)Nc1ccccc1
InChI Key: InChIKey=LFADCKLRFUABNK-UHFFFAOYSA-N
Data: 1 IC50
Activity Spreadsheet -- Enzyme Inhibition Constant Data from BindingDB
Found 1 hit for monomerid = 50216729
Trg + Lig
Ki
nM
ΔG°
kcal/mole
IC50
nM
Kd
nM
EC50/IC50
nM
koff
s-1
kon
M-1s-1
pHTemp
°C
Dual specificity calcium/calmodulin-dependent 3',5'-cyclic nucleotide phosphodiesterase 1A/1B
(Bos taurus-BOVINE)
BDBM50216729
(CHEMBL422519)
Show SMILES OC(=O)C(F)(F)F.NCCCNCCCCNCCCNC(=O)Nc1ccccc1
Show InChI InChI=1S/C17H31N5O/c18-10-6-13-19-11-4-5-12-20-14-7-15-21-17(23)22-16-8-2-1-3-9-16/h1-3,8-9,19-20H,4-7,10-15,18H2,(H2,21,22,23)
n/an/a 5.84E+5n/an/an/an/an/an/a
Universite de Rennes
Curated by ChEMBL
Assay Description
Inhibition of calmodulin dependent phosphodiesterase
Bioorg Med Chem Lett 8: 635-40 (1998)
BindingDB Entry DOI: 10.7270/Q2NV9MFT