null
SMILES: ONC(=O)C[C@@H](CCCC1CCCCC1)c1nc(no1)-c1cnccn1
InChI Key: InChIKey=FQISSGQJHGCPIL-CQSZACIVSA-N
Activity Spreadsheet -- Enzyme Inhibition Constant Data from BindingDB
Found 1 hit for monomerid = 50216808
Trg + Lig
Ki
nM
ΔG°
kcal/mole
IC50
nM
Kd
nM
EC50/IC50
nM
koff
s-1
kon
M-1s-1
pHTemp
°C
Bone morphogenetic protein 1
(Homo sapiens (Human))
BDBM50216808
((3R)-6-cyclohexyl-N-hydroxy-3-[3-(2-pyrazinyl)-1,2...)
Show SMILES ONC(=O)C[C@@H](CCCC1CCCCC1)c1nc(no1)-c1cnccn1
Show InChI InChI=1S/C18H25N5O3/c24-16(22-25)11-14(8-4-7-13-5-2-1-3-6-13)18-21-17(23-26-18)15-12-19-9-10-20-15/h9-10,12-14,25H,1-8,11H2,(H,22,24)/t14-/m1/s1
Reactome pathway
n/an/a 14n/an/an/an/an/an/a
Pfizer Global Research and Development
Curated by ChEMBL
Assay Description
Inhibition of human procollagen C-proteinase expressed in CHO cells
J Med Chem 50: 3442-56 (2007)
Article DOI: 10.1021/jm061010z
BindingDB Entry DOI: 10.7270/Q2W66KGB