BDBM50217004 CHEMBL70925
SMILES: [H][C@@]12CC[C@H](O)[C@@]1(C)CC[C@@]1([H])[C@@]2([H])CC[C@]2([H])C\C(CC[C@]12C)=N\O
InChI Key: InChIKey=VHLNMRCAXRWHOK-IGDIZZQHSA-N
Data: 1 IC50
Activity Spreadsheet -- Enzyme Inhibition Constant Data from BindingDB
Found 1 hit for monomerid = 50217004
Trg + Lig
Ki
nM
ΔG°
kcal/mole
IC50
nM
Kd
nM
EC50/IC50
nM
koff
s-1
kon
M-1s-1
pHTemp
°C
Pyruvate dehydrogenase kinase
(Homo sapiens (Human))
BDBM50217004
(CHEMBL70925)
Show SMILES [H][C@@]12CC[C@H](O)[C@@]1(C)CC[C@@]1([H])[C@@]2([H])CC[C@]2([H])C\C(CC[C@]12C)=N\O
Show InChI InChI=1S/C19H31NO2/c1-18-9-7-13(20-22)11-12(18)3-4-14-15-5-6-17(21)19(15,2)10-8-16(14)18/h12,14-17,21-22H,3-11H2,1-2H3/b20-13+/t12-,14+,15+,16+,17+,18+,19+/m1/s1
n/an/a 3.60E+4n/an/an/an/an/an/a
Novartis Institute for Biomedical Research
Curated by ChEMBL
Assay Description
In vitro inhibitory activity against pyruvate dehydrogenase kinase was determined
Bioorg Med Chem Lett 9: 2223-8 (1999)
BindingDB Entry DOI: 10.7270/Q2RN3B1Q