BDBM50217222 CHEMBL226534::N-{(1S,2S)-2-(3-cyanophenyl)-3-[4-(2-fluoroethoxy)phenyl)]-1-methylpropyl}-2-methyl-2-{[5-(trifluoromethyl)pyridin-2-yl]oxy}propanamide
SMILES: C[C@H](NC(=O)C(C)(C)Oc1ccc(cn1)C(F)(F)F)[C@@H](Cc1ccc(OCCF)cc1)c1cccc(c1)C#N
InChI Key: InChIKey=RQTWLERVPPXXLP-UQBPGWFLSA-N
Data: 1 IC50
Activity Spreadsheet -- Enzyme Inhibition Constant Data from BindingDB
Found 1 hit for monomerid = 50217222
Trg + Lig
Ki
nM
ΔG°
kcal/mole
IC50
nM
Kd
nM
EC50/IC50
nM
koff
s-1
kon
M-1s-1
pHTemp
°C
Cannabinoid receptor 1
(Homo sapiens (Human))
BDBM50217222
(CHEMBL226534 | N-{(1S,2S)-2-(3-cyanophenyl)-3-[4-(...)
Show SMILES C[C@H](NC(=O)C(C)(C)Oc1ccc(cn1)C(F)(F)F)[C@@H](Cc1ccc(OCCF)cc1)c1cccc(c1)C#N
Show InChI InChI=1S/C29H29F4N3O3/c1-19(36-27(37)28(2,3)39-26-12-9-23(18-35-26)29(31,32)33)25(22-6-4-5-21(15-22)17-34)16-20-7-10-24(11-8-20)38-14-13-30/h4-12,15,18-19,25H,13-14,16H2,1-3H3,(H,36,37)/t19-,25+/m0/s1
NCI pathway
Reactome pathway
n/an/a 0.900n/an/an/an/an/an/a
TBA
Curated by ChEMBL
Assay Description
Displacement of [3H]CP55940 from human recombinant CB1R expressed in CHO cells
J Med Chem 50: 3427-30 (2007)
Article DOI: 10.1021/jm070131b
BindingDB Entry DOI: 10.7270/Q2Z037VJ