BDBM50217354 4-(6-amino-5-((methoxyimino)methyl)pyrimidin-4-yl)-N-(4-morpholinophenyl)piperazine-1-carboxamide::CHEMBL238010
SMILES: CO\N=C\c1c(N)ncnc1N1CCN(CC1)C(=O)Nc1ccc(cc1)N1CCOCC1
InChI Key: InChIKey=XXPQNLGKRFMPLE-AFUMVMLFSA-N
Data: 1 IC50
Activity Spreadsheet -- Enzyme Inhibition Constant Data from BindingDB
Found 1 hit for monomerid = 50217354
Trg + Lig
Ki
nM
ΔG°
kcal/mole
IC50
nM
Kd
nM
EC50/IC50
nM
koff
s-1
kon
M-1s-1
pHTemp
°C
Receptor-type tyrosine-protein kinase FLT3
(Homo sapiens (Human))
BDBM50217354
(4-(6-amino-5-((methoxyimino)methyl)pyrimidin-4-yl)...)
Show SMILES CO\N=C\c1c(N)ncnc1N1CCN(CC1)C(=O)Nc1ccc(cc1)N1CCOCC1
Show InChI InChI=1S/C21H28N8O3/c1-31-25-14-18-19(22)23-15-24-20(18)28-6-8-29(9-7-28)21(30)26-16-2-4-17(5-3-16)27-10-12-32-13-11-27/h2-5,14-15H,6-13H2,1H3,(H,26,30)(H2,22,23,24)/b25-14+
n/an/a 340n/an/an/an/an/an/a
Johnson and Johnson Pharmaceutical Research and Development LLC
Curated by ChEMBL
Assay Description
Inhibition of human FLT3
Bioorg Med Chem Lett 17: 4861-5 (2007)
Article DOI: 10.1016/j.bmcl.2007.06.046
BindingDB Entry DOI: 10.7270/Q2T72H47