BDBM50217425 2S,3R,5S-4-({2-carboxy-2-[(1-methyl-cyclohexanecarbonyl)-amino]-ethylcarbamoyl}-methoxy)-2-[(4-methoxy-pyridin-2-ylamino)-methyl]-pyrrolidine-1-carboxylic acid benzyl ester::CHEMBL241834
SMILES: COc1ccnc(NC[C@@H]2C[C@H](CN2C(=O)OCc2ccccc2)OCC(=O)NC[C@H](NC(=O)C2(C)CCCCC2)C(O)=O)c1
InChI Key: InChIKey=IPSRDFZOWABPRU-DMDYGQEQSA-N
Data: 4 IC50
Activity Spreadsheet -- Enzyme Inhibition Constant Data from BindingDB
Found 4 hits for monomerid = 50217425
Trg + Lig
Ki
nM
ΔG°
kcal/mole
IC50
nM
Kd
nM
EC50/IC50
nM
koff
s-1
kon
M-1s-1
pHTemp
°C
Integrin alpha-IIb/beta-3
(Homo sapiens (Human))
BDBM50217425
(2S,3R,5S-4-({2-carboxy-2-[(1-methyl-cyclohexanecar...)
Show SMILES COc1ccnc(NC[C@@H]2C[C@H](CN2C(=O)OCc2ccccc2)OCC(=O)NC[C@H](NC(=O)C2(C)CCCCC2)C(O)=O)c1
Show InChI InChI=1S/C32H43N5O8/c1-32(12-7-4-8-13-32)30(41)36-26(29(39)40)18-35-28(38)21-44-25-15-23(17-34-27-16-24(43-2)11-14-33-27)37(19-25)31(42)45-20-22-9-5-3-6-10-22/h3,5-6,9-11,14,16,23,25-26H,4,7-8,12-13,15,17-21H2,1-2H3,(H,33,34)(H,35,38)(H,36,41)(H,39,40)/t23-,25+,26-/m0/s1
n/an/a>5.00E+4n/an/an/an/an/an/a
Jerini AG
Curated by ChEMBL
Assay Description
Inhibition of integrin alpha2bbeta3 receptor by ELISA
J Med Chem 50: 3786-94 (2007)
Article DOI: 10.1021/jm070002v
BindingDB Entry DOI: 10.7270/Q2PG1RFZ
ITGAV/ITGB5
(Homo sapiens (Human))
BDBM50217425
(2S,3R,5S-4-({2-carboxy-2-[(1-methyl-cyclohexanecar...)
Show SMILES COc1ccnc(NC[C@@H]2C[C@H](CN2C(=O)OCc2ccccc2)OCC(=O)NC[C@H](NC(=O)C2(C)CCCCC2)C(O)=O)c1
Show InChI InChI=1S/C32H43N5O8/c1-32(12-7-4-8-13-32)30(41)36-26(29(39)40)18-35-28(38)21-44-25-15-23(17-34-27-16-24(43-2)11-14-33-27)37(19-25)31(42)45-20-22-9-5-3-6-10-22/h3,5-6,9-11,14,16,23,25-26H,4,7-8,12-13,15,17-21H2,1-2H3,(H,33,34)(H,35,38)(H,36,41)(H,39,40)/t23-,25+,26-/m0/s1
NCI pathway
Reactome pathway
n/an/a 3.10E+3n/an/an/an/an/an/a
Jerini AG
Curated by ChEMBL
Assay Description
Inhibition of integrin alphaVbeta5 receptor by ELISA
J Med Chem 50: 3786-94 (2007)
Article DOI: 10.1021/jm070002v
BindingDB Entry DOI: 10.7270/Q2PG1RFZ
ITGA5/ITGB1
(Homo sapiens (Human))
BDBM50217425
(2S,3R,5S-4-({2-carboxy-2-[(1-methyl-cyclohexanecar...)
Show SMILES COc1ccnc(NC[C@@H]2C[C@H](CN2C(=O)OCc2ccccc2)OCC(=O)NC[C@H](NC(=O)C2(C)CCCCC2)C(O)=O)c1
Show InChI InChI=1S/C32H43N5O8/c1-32(12-7-4-8-13-32)30(41)36-26(29(39)40)18-35-28(38)21-44-25-15-23(17-34-27-16-24(43-2)11-14-33-27)37(19-25)31(42)45-20-22-9-5-3-6-10-22/h3,5-6,9-11,14,16,23,25-26H,4,7-8,12-13,15,17-21H2,1-2H3,(H,33,34)(H,35,38)(H,36,41)(H,39,40)/t23-,25+,26-/m0/s1
n/an/a 0.800n/an/an/an/an/an/a
Jerini AG
Curated by ChEMBL
Assay Description
Inhibition of integrin alpha5beta1 receptor by ELISA
J Med Chem 50: 3786-94 (2007)
Article DOI: 10.1021/jm070002v
BindingDB Entry DOI: 10.7270/Q2PG1RFZ
ITGAV/ITGB3
(Homo sapiens (Human))
BDBM50217425
(2S,3R,5S-4-({2-carboxy-2-[(1-methyl-cyclohexanecar...)
Show SMILES COc1ccnc(NC[C@@H]2C[C@H](CN2C(=O)OCc2ccccc2)OCC(=O)NC[C@H](NC(=O)C2(C)CCCCC2)C(O)=O)c1
Show InChI InChI=1S/C32H43N5O8/c1-32(12-7-4-8-13-32)30(41)36-26(29(39)40)18-35-28(38)21-44-25-15-23(17-34-27-16-24(43-2)11-14-33-27)37(19-25)31(42)45-20-22-9-5-3-6-10-22/h3,5-6,9-11,14,16,23,25-26H,4,7-8,12-13,15,17-21H2,1-2H3,(H,33,34)(H,35,38)(H,36,41)(H,39,40)/t23-,25+,26-/m0/s1
n/an/a 690n/an/an/an/an/an/a
Jerini AG
Curated by ChEMBL
Assay Description
Inhibition of integrin alphaVbeta3 receptor by ELISA
J Med Chem 50: 3786-94 (2007)
Article DOI: 10.1021/jm070002v
BindingDB Entry DOI: 10.7270/Q2PG1RFZ