null
SMILES: NC(=N)NCCC[C@@H]1[C@H](N(C(=O)N2CCN(CC2)C(=O)c2ccccc2)C1=O)C(O)=O
InChI Key: InChIKey=WKMOUBHSDIPQLZ-CABCVRRESA-N
Activity Spreadsheet -- Enzyme Inhibition Constant Data from BindingDB
Found 1 hit for monomerid = 50217805
Trg + Lig
Ki
nM
ΔG°
kcal/mole
IC50
nM
Kd
nM
EC50/IC50
nM
koff
s-1
kon
M-1s-1
pHTemp
°C
Tryptase delta
(Homo sapiens (Human))
BDBM50217805
(CHEMBL111548)
Show SMILES NC(=N)NCCC[C@@H]1[C@H](N(C(=O)N2CCN(CC2)C(=O)c2ccccc2)C1=O)C(O)=O
Show InChI InChI=1S/C20H26N6O5/c21-19(22)23-8-4-7-14-15(18(29)30)26(17(14)28)20(31)25-11-9-24(10-12-25)16(27)13-5-2-1-3-6-13/h1-3,5-6,14-15H,4,7-12H2,(H,29,30)(H4,21,22,23)/t14-,15+/m1/s1
n/an/a 5.20n/an/an/an/an/an/a
The Bristol-Myers Squibb Pharmaceutical Research Institute
Curated by ChEMBL
Assay Description
In vitro inhibition of human tryptase.
Bioorg Med Chem Lett 12: 3229-33 (2002)
BindingDB Entry DOI: 10.7270/Q2QC05PZ