BDBM50218121 CHEMBL390675::naphthalen-1-yl-(4-pentylaminonaphthalen-1-yl)methanone
SMILES: CCCCCNc1ccc(C(=O)c2cccc3ccccc23)c2ccccc12
InChI Key: InChIKey=ZBSLIPYRPMLJDW-UHFFFAOYSA-N
Data: 2 IC50
Activity Spreadsheet -- Enzyme Inhibition Constant Data from BindingDB
Found 2 hits for monomerid = 50218121
Trg + Lig
Ki
nM
ΔG°
kcal/mole
IC50
nM
Kd
nM
EC50/IC50
nM
koff
s-1
kon
M-1s-1
pHTemp
°C
Cannabinoid receptor 1
(Homo sapiens (Human))
BDBM50218121
(CHEMBL390675 | naphthalen-1-yl-(4-pentylaminonapht...)
Show SMILES CCCCCNc1ccc(C(=O)c2cccc3ccccc23)c2ccccc12
Show InChI InChI=1S/C26H25NO/c1-2-3-8-18-27-25-17-16-24(21-13-6-7-14-22(21)25)26(28)23-15-9-11-19-10-4-5-12-20(19)23/h4-7,9-17,27H,2-3,8,18H2,1H3
NCI pathway
Reactome pathway
n/an/a 25n/an/an/an/an/an/a
Novartis Institutes for BioMedical Research
Curated by ChEMBL
Assay Description
Displacement of [3H]CP-55940 from human CB1 receptor expressed in HEK293 cells
J Med Chem 50: 3851-6 (2007)
Article DOI: 10.1021/jm070317a
BindingDB Entry DOI: 10.7270/Q2K64JWR
Cannabinoid receptor 2
(Homo sapiens (Human))
BDBM50218121
(CHEMBL390675 | naphthalen-1-yl-(4-pentylaminonapht...)
Show SMILES CCCCCNc1ccc(C(=O)c2cccc3ccccc23)c2ccccc12
Show InChI InChI=1S/C26H25NO/c1-2-3-8-18-27-25-17-16-24(21-13-6-7-14-22(21)25)26(28)23-15-9-11-19-10-4-5-12-20(19)23/h4-7,9-17,27H,2-3,8,18H2,1H3
Reactome pathway
n/an/a 120n/an/an/an/an/an/a
Novartis Institutes for BioMedical Research
Curated by ChEMBL
Assay Description
Displacement of [3H]CP-55940 human CB2 receptor expressed in CHOK1 cells
J Med Chem 50: 3851-6 (2007)
Article DOI: 10.1021/jm070317a
BindingDB Entry DOI: 10.7270/Q2K64JWR