BDBM50218239 (3S,4R)-3-((R)-1-(3,5-bis(trifluoromethyl)phenyl)ethoxy)-4-(4-fluorophenyl)-N-isopropylpyrrolidine-1-carboxamide::CHEMBL398720
SMILES: CC(C)NC(=O)N1C[C@@H](O[C@H](C)c2cc(cc(c2)C(F)(F)F)C(F)(F)F)[C@@H](C1)c1ccc(F)cc1
InChI Key: InChIKey=KOEGRIPAKURRCQ-PUCZYUMASA-N
Data: 1 IC50
Activity Spreadsheet -- Enzyme Inhibition Constant Data from BindingDB
Found 1 hit for monomerid = 50218239
Trg + Lig
Ki
nM
ΔG°
kcal/mole
IC50
nM
Kd
nM
EC50/IC50
nM
koff
s-1
kon
M-1s-1
pHTemp
°C
Neurokinin 1 receptor
(Homo sapiens (Human))
BDBM50218239
((3S,4R)-3-((R)-1-(3,5-bis(trifluoromethyl)phenyl)e...)
Show SMILES CC(C)NC(=O)N1C[C@@H](O[C@H](C)c2cc(cc(c2)C(F)(F)F)C(F)(F)F)[C@@H](C1)c1ccc(F)cc1
Show InChI InChI=1S/C24H25F7N2O2/c1-13(2)32-22(34)33-11-20(15-4-6-19(25)7-5-15)21(12-33)35-14(3)16-8-17(23(26,27)28)10-18(9-16)24(29,30)31/h4-10,13-14,20-21H,11-12H2,1-3H3,(H,32,34)/t14-,20+,21-/m1/s1
Reactome pathway
n/an/a 0.0600n/an/an/an/an/an/a
Merck & Co. Inc.
Curated by ChEMBL
Assay Description
Displacement of [3H]SP from human NK1 receptor expressed in CHO cells
Bioorg Med Chem Lett 17: 5191-8 (2007)
Article DOI: 10.1016/j.bmcl.2007.06.085
BindingDB Entry DOI: 10.7270/Q2GT5MW7