BDBM50218274 (Z)-N-(5-tert-butyl-4-methyl-3-(prop-2-ynyl)thiazol-2(3H)-ylidene)benzenesulfonamide::CHEMBL398778
SMILES: Cc1c(s\c(=N/S(=O)(=O)c2ccccc2)n1CC#C)C(C)(C)C
InChI Key: InChIKey=YBENEEPGIVIIQD-VLGSPTGOSA-N
Data: 1 IC50
Activity Spreadsheet -- Enzyme Inhibition Constant Data from BindingDB
Found 1 hit for monomerid = 50218274
Trg + Lig
Ki
nM
ΔG°
kcal/mole
IC50
nM
Kd
nM
EC50/IC50
nM
koff
s-1
kon
M-1s-1
pHTemp
°C
Cannabinoid receptor 2
(Homo sapiens (Human))
BDBM50218274
((Z)-N-(5-tert-butyl-4-methyl-3-(prop-2-ynyl)thiazo...)
Show SMILES Cc1c(s\c(=N/S(=O)(=O)c2ccccc2)n1CC#C)C(C)(C)C
Show InChI InChI=1S/C17H20N2O2S2/c1-6-12-19-13(2)15(17(3,4)5)22-16(19)18-23(20,21)14-10-8-7-9-11-14/h1,7-11H,12H2,2-5H3/b18-16-
Reactome pathway
n/an/a 210n/an/an/an/an/an/a
Taisho Pharmaceutical Co., Ltd
Curated by ChEMBL
Assay Description
Displacement of [3H] CP-55,940 from human CB2 receptor expressed in CHO cells
Bioorg Med Chem Lett 17: 5133-5 (2007)
Article DOI: 10.1016/j.bmcl.2007.07.005
BindingDB Entry DOI: 10.7270/Q27944C0