BDBM50218385 CHEMBL309916
SMILES: CCc1c(-c2ccccc2)c2ccc3cc(O)cc1n23
InChI Key: InChIKey=ICBNFMZZQJJWOQ-UHFFFAOYSA-N
Data: 1 IC50
Activity Spreadsheet -- Enzyme Inhibition Constant Data from BindingDB
Found 1 hit for monomerid = 50218385
Trg + Lig
Ki
nM
ΔG°
kcal/mole
IC50
nM
Kd
nM
EC50/IC50
nM
koff
s-1
kon
M-1s-1
pHTemp
°C
Estrogen receptor beta
(Homo sapiens (Human))
BDBM50218385
(CHEMBL309916)
Show SMILES CCc1c(-c2ccccc2)c2ccc3cc(O)cc1n23
Show InChI InChI=1S/C18H15NO/c1-2-15-17-11-14(20)10-13-8-9-16(19(13)17)18(15)12-6-4-3-5-7-12/h3-11,20H,2H2,1H3
n/an/a 1.30E+3n/an/an/an/an/an/a
Novo Nordisk A/S
Curated by ChEMBL
Assay Description
Inhibitory activity against Estrogen receptor by displacement of [3H]17-beta-estradiol in ER-rich cytosol from rabbit uterine tissue
Bioorg Med Chem Lett 10: 2383-6 (2000)
BindingDB Entry DOI: 10.7270/Q28G8NWG