null
SMILES: CN1CCN(CC1)S(=O)(=O)c1ccc2N(C)c3cc4c(cc3C(=Nc2c1)c1ccc(cc1)C(O)=O)C(C)(C)CCC4(C)C
InChI Key: InChIKey=ZEJDSUGZNLJRPP-UHFFFAOYSA-N
Activity Spreadsheet -- Enzyme Inhibition Constant Data from BindingDB
Found 2 hits for monomerid = 50218431
Trg + Lig
Ki
nM
ΔG°
kcal/mole
IC50
nM
Kd
nM
EC50/IC50
nM
koff
s-1
kon
M-1s-1
pHTemp
°C
Retinoic acid receptor RXR-alpha
(Homo sapiens (Human))
BDBM50218431
(4-[5,7,7,10,10-pentamethyl-2-(4-methyl-piperazine-...)
Show SMILES CN1CCN(CC1)S(=O)(=O)c1ccc2N(C)c3cc4c(cc3C(=Nc2c1)c1ccc(cc1)C(O)=O)C(C)(C)CCC4(C)C |c:24|
Show InChI InChI=1S/C34H40N4O4S/c1-33(2)13-14-34(3,4)27-21-30-25(20-26(27)33)31(22-7-9-23(10-8-22)32(39)40)35-28-19-24(11-12-29(28)37(30)6)43(41,42)38-17-15-36(5)16-18-38/h7-12,19-21H,13-18H2,1-6H3,(H,39,40)
NCI pathway
Reactome pathway
n/an/a 1.90E+3n/an/an/an/an/an/a
Tsukuba Research Institute
Curated by ChEMBL
Assay Description
Inhibition of LG100268-induced RXRalpha transactivation
Bioorg Med Chem Lett 17: 4804-7 (2007)
Article DOI: 10.1016/j.bmcl.2007.06.080
BindingDB Entry DOI: 10.7270/Q2ZS2W7W
Retinoic acid receptor RXR-alpha
(Homo sapiens (Human))
BDBM50218431
(4-[5,7,7,10,10-pentamethyl-2-(4-methyl-piperazine-...)
Show SMILES CN1CCN(CC1)S(=O)(=O)c1ccc2N(C)c3cc4c(cc3C(=Nc2c1)c1ccc(cc1)C(O)=O)C(C)(C)CCC4(C)C |c:24|
Show InChI InChI=1S/C34H40N4O4S/c1-33(2)13-14-34(3,4)27-21-30-25(20-26(27)33)31(22-7-9-23(10-8-22)32(39)40)35-28-19-24(11-12-29(28)37(30)6)43(41,42)38-17-15-36(5)16-18-38/h7-12,19-21H,13-18H2,1-6H3,(H,39,40)
NCI pathway
Reactome pathway
n/an/a 1.00E+3n/an/an/an/an/an/a
Tsukuba Research Institute
Curated by ChEMBL
Assay Description
Inhibition of 9-cis-retinoic acid-induced RXRalpha transactivation
Bioorg Med Chem Lett 17: 4804-7 (2007)
Article DOI: 10.1016/j.bmcl.2007.06.080
BindingDB Entry DOI: 10.7270/Q2ZS2W7W