BDBM50218437 4-[5,7,7,10,10-pentamethyl-2-(4-methyl-piperazin-1-yl)-7,8,9,10-tetrahydro-5H-5,13-diaza-benzo[4,5]cyclohepta[1,2-b]naphthalen-12-yl]-benzoic acid::CHEMBL245041
SMILES: CN1CCN(CC1)c1ccc2N(C)c3cc4c(cc3C(=Nc2c1)c1ccc(cc1)C(O)=O)C(C)(C)CCC4(C)C
InChI Key: InChIKey=OMEDTFHXBJMGOD-UHFFFAOYSA-N
Data: 1 IC50
Activity Spreadsheet -- Enzyme Inhibition Constant Data from BindingDB
Found 1 hit for monomerid = 50218437
Trg + Lig
Ki
nM
ΔG°
kcal/mole
IC50
nM
Kd
nM
EC50/IC50
nM
koff
s-1
kon
M-1s-1
pHTemp
°C
Retinoic acid receptor RXR-alpha
(Homo sapiens (Human))
BDBM50218437
(4-[5,7,7,10,10-pentamethyl-2-(4-methyl-piperazin-1...)
Show SMILES CN1CCN(CC1)c1ccc2N(C)c3cc4c(cc3C(=Nc2c1)c1ccc(cc1)C(O)=O)C(C)(C)CCC4(C)C |c:21|
Show InChI InChI=1S/C34H40N4O2/c1-33(2)13-14-34(3,4)27-21-30-25(20-26(27)33)31(22-7-9-23(10-8-22)32(39)40)35-28-19-24(11-12-29(28)37(30)6)38-17-15-36(5)16-18-38/h7-12,19-21H,13-18H2,1-6H3,(H,39,40)
NCI pathway
Reactome pathway
n/an/a 1.10E+4n/an/an/an/an/an/a
Tsukuba Research Institute
Curated by ChEMBL
Assay Description
Inhibition of LG100268-induced RXRalpha transactivation
Bioorg Med Chem Lett 17: 4804-7 (2007)
Article DOI: 10.1016/j.bmcl.2007.06.080
BindingDB Entry DOI: 10.7270/Q2ZS2W7W