BDBM50218439 4-(5,7,7,10,10-pentamethyl-2-methylsulfamoyl-7,8,9,10-tetrahydro-5H-5,13-diaza-benzo[4,5]cyclohepta[1,2-b]naphthalen-12-yl)-benzoic acid::CHEMBL389760
SMILES: CNS(=O)(=O)c1ccc2N(C)c3cc4c(cc3C(=Nc2c1)c1ccc(cc1)C(O)=O)C(C)(C)CCC4(C)C
InChI Key: InChIKey=BNDKLEVYJAZLIZ-UHFFFAOYSA-N
Data: 2 IC50
Activity Spreadsheet -- Enzyme Inhibition Constant Data from BindingDB
Found 2 hits for monomerid = 50218439
Trg + Lig
Ki
nM
ΔG°
kcal/mole
IC50
nM
Kd
nM
EC50/IC50
nM
koff
s-1
kon
M-1s-1
pHTemp
°C
Retinoic acid receptor RXR-alpha
(Homo sapiens (Human))
BDBM50218439
(4-(5,7,7,10,10-pentamethyl-2-methylsulfamoyl-7,8,9...)
Show SMILES CNS(=O)(=O)c1ccc2N(C)c3cc4c(cc3C(=Nc2c1)c1ccc(cc1)C(O)=O)C(C)(C)CCC4(C)C |c:18|
Show InChI InChI=1S/C30H33N3O4S/c1-29(2)13-14-30(3,4)23-17-26-21(16-22(23)29)27(18-7-9-19(10-8-18)28(34)35)32-24-15-20(38(36,37)31-5)11-12-25(24)33(26)6/h7-12,15-17,31H,13-14H2,1-6H3,(H,34,35)
NCI pathway
Reactome pathway
n/an/a 1.30E+3n/an/an/an/an/an/a
Tsukuba Research Institute
Curated by ChEMBL
Assay Description
Inhibition of 9-cis-retinoic acid-induced RXRalpha transactivation
Bioorg Med Chem Lett 17: 4804-7 (2007)
Article DOI: 10.1016/j.bmcl.2007.06.080
BindingDB Entry DOI: 10.7270/Q2ZS2W7W
Retinoic acid receptor RXR-alpha
(Homo sapiens (Human))
BDBM50218439
(4-(5,7,7,10,10-pentamethyl-2-methylsulfamoyl-7,8,9...)
Show SMILES CNS(=O)(=O)c1ccc2N(C)c3cc4c(cc3C(=Nc2c1)c1ccc(cc1)C(O)=O)C(C)(C)CCC4(C)C |c:18|
Show InChI InChI=1S/C30H33N3O4S/c1-29(2)13-14-30(3,4)23-17-26-21(16-22(23)29)27(18-7-9-19(10-8-18)28(34)35)32-24-15-20(38(36,37)31-5)11-12-25(24)33(26)6/h7-12,15-17,31H,13-14H2,1-6H3,(H,34,35)
NCI pathway
Reactome pathway
n/an/a 1.30E+3n/an/an/an/an/an/a
Tsukuba Research Institute
Curated by ChEMBL
Assay Description
Inhibition of LG100268-induced RXRalpha transactivation
Bioorg Med Chem Lett 17: 4804-7 (2007)
Article DOI: 10.1016/j.bmcl.2007.06.080
BindingDB Entry DOI: 10.7270/Q2ZS2W7W