BDBM50218440 4-(2-acetyl-5,7,7,10,10-pentamethyl-7,8,9,10-tetrahydro-5H-5,13-diaza-benzo[4,5]cyclohepta[1,2-b]naphthalen-12-yl)-2-fluoro-benzoic acid::CHEMBL243133
SMILES: CN1c2ccc(cc2N=C(c2ccc(C(O)=O)c(F)c2)c2cc3c(cc12)C(C)(C)CCC3(C)C)C(C)=O
InChI Key: InChIKey=NSJANOUQTMYXKY-UHFFFAOYSA-N
Data: 2 IC50
Activity Spreadsheet -- Enzyme Inhibition Constant Data from BindingDB
Found 2 hits for monomerid = 50218440
Trg + Lig
Ki
nM
ΔG°
kcal/mole
IC50
nM
Kd
nM
EC50/IC50
nM
koff
s-1
kon
M-1s-1
pHTemp
°C
Retinoic acid receptor RXR-alpha
(Homo sapiens (Human))
BDBM50218440
(4-(2-acetyl-5,7,7,10,10-pentamethyl-7,8,9,10-tetra...)
Show SMILES CN1c2ccc(cc2N=C(c2ccc(C(O)=O)c(F)c2)c2cc3c(cc12)C(C)(C)CCC3(C)C)C(C)=O |t:9|
Show InChI InChI=1S/C31H31FN2O3/c1-17(35)18-8-10-26-25(14-18)33-28(19-7-9-20(29(36)37)24(32)13-19)21-15-22-23(16-27(21)34(26)6)31(4,5)12-11-30(22,2)3/h7-10,13-16H,11-12H2,1-6H3,(H,36,37)
NCI pathway
Reactome pathway
n/an/a 1.10E+3n/an/an/an/an/an/a
Tsukuba Research Institute
Curated by ChEMBL
Assay Description
Inhibition of 9-cis-retinoic acid-induced RXRalpha transactivation
Bioorg Med Chem Lett 17: 4804-7 (2007)
Article DOI: 10.1016/j.bmcl.2007.06.080
BindingDB Entry DOI: 10.7270/Q2ZS2W7W
Retinoic acid receptor RXR-alpha
(Homo sapiens (Human))
BDBM50218440
(4-(2-acetyl-5,7,7,10,10-pentamethyl-7,8,9,10-tetra...)
Show SMILES CN1c2ccc(cc2N=C(c2ccc(C(O)=O)c(F)c2)c2cc3c(cc12)C(C)(C)CCC3(C)C)C(C)=O |t:9|
Show InChI InChI=1S/C31H31FN2O3/c1-17(35)18-8-10-26-25(14-18)33-28(19-7-9-20(29(36)37)24(32)13-19)21-15-22-23(16-27(21)34(26)6)31(4,5)12-11-30(22,2)3/h7-10,13-16H,11-12H2,1-6H3,(H,36,37)
NCI pathway
Reactome pathway
n/an/a 1.70E+3n/an/an/an/an/an/a
Tsukuba Research Institute
Curated by ChEMBL
Assay Description
Inhibition of LG100268-induced RXRalpha transactivation
Bioorg Med Chem Lett 17: 4804-7 (2007)
Article DOI: 10.1016/j.bmcl.2007.06.080
BindingDB Entry DOI: 10.7270/Q2ZS2W7W