BDBM50218441 4-(2-cyano-5-ethyl-7,7,10,10-tetramethyl-7,8,9,10-tetrahydro-5H-5,13-diaza-benzo[4,5]cyclohepta[1,2-b]naphthalen-12-yl)-3-fluoro-benzoic acid::CHEMBL242274
SMILES: CCN1c2ccc(cc2N=C(c2ccc(cc2F)C(O)=O)c2cc3c(cc12)C(C)(C)CCC3(C)C)C#N
InChI Key: InChIKey=FHGDUTQCJGHDMD-UHFFFAOYSA-N
Data: 2 IC50
Activity Spreadsheet -- Enzyme Inhibition Constant Data from BindingDB
Found 2 hits for monomerid = 50218441
Trg + Lig
Ki
nM
ΔG°
kcal/mole
IC50
nM
Kd
nM
EC50/IC50
nM
koff
s-1
kon
M-1s-1
pHTemp
°C
Retinoic acid receptor RXR-alpha
(Homo sapiens (Human))
BDBM50218441
(4-(2-cyano-5-ethyl-7,7,10,10-tetramethyl-7,8,9,10-...)
Show SMILES CCN1c2ccc(cc2N=C(c2ccc(cc2F)C(O)=O)c2cc3c(cc12)C(C)(C)CCC3(C)C)C#N |t:10|
Show InChI InChI=1S/C31H30FN3O2/c1-6-35-26-10-7-18(17-33)13-25(26)34-28(20-9-8-19(29(36)37)14-24(20)32)21-15-22-23(16-27(21)35)31(4,5)12-11-30(22,2)3/h7-10,13-16H,6,11-12H2,1-5H3,(H,36,37)
NCI pathway
Reactome pathway
n/an/a 1.10E+3n/an/an/an/an/an/a
Tsukuba Research Institute
Curated by ChEMBL
Assay Description
Inhibition of LG100268-induced RXRalpha transactivation
Bioorg Med Chem Lett 17: 4804-7 (2007)
Article DOI: 10.1016/j.bmcl.2007.06.080
BindingDB Entry DOI: 10.7270/Q2ZS2W7W
Retinoic acid receptor RXR-alpha
(Homo sapiens (Human))
BDBM50218441
(4-(2-cyano-5-ethyl-7,7,10,10-tetramethyl-7,8,9,10-...)
Show SMILES CCN1c2ccc(cc2N=C(c2ccc(cc2F)C(O)=O)c2cc3c(cc12)C(C)(C)CCC3(C)C)C#N |t:10|
Show InChI InChI=1S/C31H30FN3O2/c1-6-35-26-10-7-18(17-33)13-25(26)34-28(20-9-8-19(29(36)37)14-24(20)32)21-15-22-23(16-27(21)35)31(4,5)12-11-30(22,2)3/h7-10,13-16H,6,11-12H2,1-5H3,(H,36,37)
NCI pathway
Reactome pathway
n/an/a 530n/an/an/an/an/an/a
Tsukuba Research Institute
Curated by ChEMBL
Assay Description
Inhibition of 9-cis-retinoic acid-induced RXRalpha transactivation
Bioorg Med Chem Lett 17: 4804-7 (2007)
Article DOI: 10.1016/j.bmcl.2007.06.080
BindingDB Entry DOI: 10.7270/Q2ZS2W7W