BDBM50218446 4-[2-(4-chloro-phenylmethanesulfonyl)-5,7,7,10,10-pentamethyl-7,8,9,10-tetrahydro-5H-5,13-diaza-benzo[4,5]cyclohepta[1,2-b]naphthalen-12-yl]-benzoic acid::CHEMBL397281
SMILES: CN1c2ccc(cc2N=C(c2ccc(cc2)C(O)=O)c2cc3c(cc12)C(C)(C)CCC3(C)C)S(=O)(=O)Cc1ccc(Cl)cc1
InChI Key: InChIKey=GQCFHAUOBGCFEL-UHFFFAOYSA-N
Data: 2 IC50
Activity Spreadsheet -- Enzyme Inhibition Constant Data from BindingDB
Found 2 hits for monomerid = 50218446
Trg + Lig
Ki
nM
ΔG°
kcal/mole
IC50
nM
Kd
nM
EC50/IC50
nM
koff
s-1
kon
M-1s-1
pHTemp
°C
Retinoic acid receptor RXR-alpha
(Homo sapiens (Human))
BDBM50218446
(4-[2-(4-chloro-phenylmethanesulfonyl)-5,7,7,10,10-...)
Show SMILES CN1c2ccc(cc2N=C(c2ccc(cc2)C(O)=O)c2cc3c(cc12)C(C)(C)CCC3(C)C)S(=O)(=O)Cc1ccc(Cl)cc1 |t:9|
Show InChI InChI=1S/C36H35ClN2O4S/c1-35(2)16-17-36(3,4)29-20-32-27(19-28(29)35)33(23-8-10-24(11-9-23)34(40)41)38-30-18-26(14-15-31(30)39(32)5)44(42,43)21-22-6-12-25(37)13-7-22/h6-15,18-20H,16-17,21H2,1-5H3,(H,40,41)
NCI pathway
Reactome pathway
n/an/a 420n/an/an/an/an/an/a
Tsukuba Research Institute
Curated by ChEMBL
Assay Description
Inhibition of 9-cis-retinoic acid-induced RXRalpha transactivation
Bioorg Med Chem Lett 17: 4804-7 (2007)
Article DOI: 10.1016/j.bmcl.2007.06.080
BindingDB Entry DOI: 10.7270/Q2ZS2W7W
Retinoic acid receptor RXR-alpha
(Homo sapiens (Human))
BDBM50218446
(4-[2-(4-chloro-phenylmethanesulfonyl)-5,7,7,10,10-...)
Show SMILES CN1c2ccc(cc2N=C(c2ccc(cc2)C(O)=O)c2cc3c(cc12)C(C)(C)CCC3(C)C)S(=O)(=O)Cc1ccc(Cl)cc1 |t:9|
Show InChI InChI=1S/C36H35ClN2O4S/c1-35(2)16-17-36(3,4)29-20-32-27(19-28(29)35)33(23-8-10-24(11-9-23)34(40)41)38-30-18-26(14-15-31(30)39(32)5)44(42,43)21-22-6-12-25(37)13-7-22/h6-15,18-20H,16-17,21H2,1-5H3,(H,40,41)
NCI pathway
Reactome pathway
n/an/a 950n/an/an/an/an/an/a
Tsukuba Research Institute
Curated by ChEMBL
Assay Description
Inhibition of LG100268-induced RXRalpha transactivation
Bioorg Med Chem Lett 17: 4804-7 (2007)
Article DOI: 10.1016/j.bmcl.2007.06.080
BindingDB Entry DOI: 10.7270/Q2ZS2W7W