BDBM50218494 4-(2-benzylamino-5,7,7,10,10-pentamethyl-7,8,9,10-tetrahydro-5H-5,13-diaza-benzo[4,5]cyclohepta[1,2-b]naphthalen-12-yl)-benzoic acid::CHEMBL436999
SMILES: CCCCNc1ccc2N(C)c3cc4c(cc3C(=Nc2c1)c1ccc(cc1)C(O)=O)C(C)(C)CCC4(C)C
InChI Key: InChIKey=AOHQOVBPAMPGOX-UHFFFAOYSA-N
Data: 2 IC50
Activity Spreadsheet -- Enzyme Inhibition Constant Data from BindingDB
Found 2 hits for monomerid = 50218494
Trg + Lig
Ki
nM
ΔG°
kcal/mole
IC50
nM
Kd
nM
EC50/IC50
nM
koff
s-1
kon
M-1s-1
pHTemp
°C
Retinoic acid receptor RXR-alpha
(Homo sapiens (Human))
BDBM50218494
(4-(2-benzylamino-5,7,7,10,10-pentamethyl-7,8,9,10-...)
Show SMILES CCCCNc1ccc2N(C)c3cc4c(cc3C(=Nc2c1)c1ccc(cc1)C(O)=O)C(C)(C)CCC4(C)C |c:18|
Show InChI InChI=1S/C33H39N3O2/c1-7-8-17-34-23-13-14-28-27(18-23)35-30(21-9-11-22(12-10-21)31(37)38)24-19-25-26(20-29(24)36(28)6)33(4,5)16-15-32(25,2)3/h9-14,18-20,34H,7-8,15-17H2,1-6H3,(H,37,38)
NCI pathway
Reactome pathway
n/an/a>1.00E+5n/an/an/an/an/an/a
Tsukuba Research Institute
Curated by ChEMBL
Assay Description
Antagonist activity at human RXRalpha expressed in EK293 cells assessed as inhibition of LG100268-induced transactivation
Bioorg Med Chem Lett 17: 4808-11 (2007)
Article DOI: 10.1016/j.bmcl.2007.06.079
BindingDB Entry DOI: 10.7270/Q2V40TWB
Retinoic acid receptor RXR-alpha
(Homo sapiens (Human))
BDBM50218494
(4-(2-benzylamino-5,7,7,10,10-pentamethyl-7,8,9,10-...)
Show SMILES CCCCNc1ccc2N(C)c3cc4c(cc3C(=Nc2c1)c1ccc(cc1)C(O)=O)C(C)(C)CCC4(C)C |c:18|
Show InChI InChI=1S/C33H39N3O2/c1-7-8-17-34-23-13-14-28-27(18-23)35-30(21-9-11-22(12-10-21)31(37)38)24-19-25-26(20-29(24)36(28)6)33(4,5)16-15-32(25,2)3/h9-14,18-20,34H,7-8,15-17H2,1-6H3,(H,37,38)
NCI pathway
Reactome pathway
n/an/a>1.00E+4n/an/an/an/an/an/a
Tsukuba Research Institute
Curated by ChEMBL
Assay Description
Antagonist activity at human RXRalpha expressed in EK293 cells assessed as inhibition of 9-cis-retinoic acid-induced transactivation
Bioorg Med Chem Lett 17: 4808-11 (2007)
Article DOI: 10.1016/j.bmcl.2007.06.079
BindingDB Entry DOI: 10.7270/Q2V40TWB