null
SMILES: COc1cc2cc(-c3ccc(CN(C)Cc4cccc(C)c4)cc3)c(=O)oc2cc1OC
InChI Key: InChIKey=BIGKNZBLJTVJKF-UHFFFAOYSA-N
Activity Spreadsheet -- Enzyme Inhibition Constant Data from BindingDB
Found 2 hits for monomerid = 50218526
Trg + Lig
Ki
nM
ΔG°
kcal/mole
IC50
nM
Kd
nM
EC50/IC50
nM
koff
s-1
kon
M-1s-1
pHTemp
°C
Acetylcholinesterase
(Homo sapiens (Human))
BDBM50218526
(6,7-dimethoxy-3-(4-{[(3-methylbenzyl)methylamino]m...)
Show SMILES COc1cc2cc(-c3ccc(CN(C)Cc4cccc(C)c4)cc3)c(=O)oc2cc1OC
Show InChI InChI=1S/C27H27NO4/c1-18-6-5-7-20(12-18)17-28(2)16-19-8-10-21(11-9-19)23-13-22-14-25(30-3)26(31-4)15-24(22)32-27(23)29/h5-15H,16-17H2,1-4H3
NCI pathway
Reactome pathway
n/an/a 122n/an/an/an/an/an/a
University of Bologna
Curated by ChEMBL
Assay Description
Inhibition of human recombinant AChE
J Med Chem 50: 4250-4 (2007)
Article DOI: 10.1021/jm070100g
BindingDB Entry DOI: 10.7270/Q2QC036V
Cholinesterase
(Homo sapiens (Human))
BDBM50218526
(6,7-dimethoxy-3-(4-{[(3-methylbenzyl)methylamino]m...)
Show SMILES COc1cc2cc(-c3ccc(CN(C)Cc4cccc(C)c4)cc3)c(=O)oc2cc1OC
Show InChI InChI=1S/C27H27NO4/c1-18-6-5-7-20(12-18)17-28(2)16-19-8-10-21(11-9-19)23-13-22-14-25(30-3)26(31-4)15-24(22)32-27(23)29/h5-15H,16-17H2,1-4H3
Reactome pathway
n/an/a>1.00E+4n/an/an/an/an/an/a
University of Bologna
Curated by ChEMBL
Assay Description
Inhibition of human recombinant BChE
J Med Chem 50: 4250-4 (2007)
Article DOI: 10.1021/jm070100g
BindingDB Entry DOI: 10.7270/Q2QC036V