BDBM50218689 CHEMBL245230::N-(5-tert-butyl-2-methoxy-3-(3-naphthalen-1-ylureido)phenyl)methanesulfonamide::N-[5-tert-butyl-2-methoxy-3-(3-naphthalen-1-yl-ureido)-phenyl]-methanesulfonamide
SMILES: COc1c(NC(=O)Nc2cccc3ccccc23)cc(cc1NS(C)(=O)=O)C(C)(C)C
InChI Key: InChIKey=SZLHGIFFNVWTKB-UHFFFAOYSA-N
Data: 1 IC50
Activity Spreadsheet -- Enzyme Inhibition Constant Data from BindingDB
Found 1 hit for monomerid = 50218689
Trg + Lig
Ki
nM
ΔG°
kcal/mole
IC50
nM
Kd
nM
EC50/IC50
nM
koff
s-1
kon
M-1s-1
pHTemp
°C
Mitogen-activated protein kinase 14
(Homo sapiens (Human))
BDBM50218689
(CHEMBL245230 | N-(5-tert-butyl-2-methoxy-3-(3-naph...)
Show SMILES COc1c(NC(=O)Nc2cccc3ccccc23)cc(cc1NS(C)(=O)=O)C(C)(C)C
Show InChI InChI=1S/C23H27N3O4S/c1-23(2,3)16-13-19(21(30-4)20(14-16)26-31(5,28)29)25-22(27)24-18-12-8-10-15-9-6-7-11-17(15)18/h6-14,26H,1-5H3,(H2,24,25,27)
NCI pathway
Reactome pathway
n/an/a 79n/an/an/an/an/an/a
Boehringer Ingelheim Pharmaceutical
Curated by ChEMBL
Assay Description
Binding affinity to p38alpha (unknown origin) assessed as inhibition of ATF2 phosphorylation preincubated for 4 hrs
Bioorg Med Chem Lett 19: 2386-91 (2009)
Article DOI: 10.1016/j.bmcl.2009.03.104
BindingDB Entry DOI: 10.7270/Q22N525R