BDBM50218703 2-[3-(3-methoxy-4-nitrophenyl)-11-oxo-10,11-dihydro-5Hdibenzo[b,e][1,4]diazepin-7-yl]-2-methyl-N-(4-morpholin-4-ylphenyl)propanamide::CHEMBL387787
SMILES: COc1cc(ccc1N)-c1ccc2c(Nc3cc(ccc3NC2=O)C(C)(C)C(=O)Nc2ccc(cc2)N2CCOCC2)c1
InChI Key: InChIKey=FNXFVMLVCXXTQM-UHFFFAOYSA-N
Data: 1 IC50  2 EC50
Activity Spreadsheet -- Enzyme Inhibition Constant Data from BindingDB
Found 3 hits for monomerid = 50218703
Trg + Lig
Ki
nM
ΔG°
kcal/mole
IC50
nM
Kd
nM
EC50/IC50
nM
koff
s-1
kon
M-1s-1
pHTemp
°C
Serine/threonine-protein kinase Chk1
(Homo sapiens (Human))
BDBM50218703
(2-[3-(3-methoxy-4-nitrophenyl)-11-oxo-10,11-dihydr...)
Show SMILES COc1cc(ccc1N)-c1ccc2c(Nc3cc(ccc3NC2=O)C(C)(C)C(=O)Nc2ccc(cc2)N2CCOCC2)c1
Show InChI InChI=1S/C34H35N5O4/c1-34(2,33(41)36-24-7-9-25(10-8-24)39-14-16-43-17-15-39)23-6-13-28-30(20-23)37-29-18-21(4-11-26(29)32(40)38-28)22-5-12-27(35)31(19-22)42-3/h4-13,18-20,37H,14-17,35H2,1-3H3,(H,36,41)(H,38,40)
Reactome pathway
n/an/a 10n/an/an/an/an/an/a
Abbott Laboratories
Curated by ChEMBL
Assay Description
Inhibition of human recombinant Chk1
J Med Chem 50: 4162-76 (2007)
Article DOI: 10.1021/jm070105d
BindingDB Entry DOI: 10.7270/Q22J6BKS
Serine/threonine-protein kinase Chk1
(Homo sapiens (Human))
BDBM50218703
(2-[3-(3-methoxy-4-nitrophenyl)-11-oxo-10,11-dihydr...)
Show SMILES COc1cc(ccc1N)-c1ccc2c(Nc3cc(ccc3NC2=O)C(C)(C)C(=O)Nc2ccc(cc2)N2CCOCC2)c1
Show InChI InChI=1S/C34H35N5O4/c1-34(2,33(41)36-24-7-9-25(10-8-24)39-14-16-43-17-15-39)23-6-13-28-30(20-23)37-29-18-21(4-11-26(29)32(40)38-28)22-5-12-27(35)31(19-22)42-3/h4-13,18-20,37H,14-17,35H2,1-3H3,(H,36,41)(H,38,40)
Reactome pathway
n/an/an/an/a>5.93E+4n/an/an/an/a
Abbott Laboratories
Curated by ChEMBL
Assay Description
Antiproliferative activity against HeLa cells by MTS assay
J Med Chem 50: 4162-76 (2007)
Article DOI: 10.1021/jm070105d
BindingDB Entry DOI: 10.7270/Q22J6BKS
Serine/threonine-protein kinase Chk1
(Homo sapiens (Human))
BDBM50218703
(2-[3-(3-methoxy-4-nitrophenyl)-11-oxo-10,11-dihydr...)
Show SMILES COc1cc(ccc1N)-c1ccc2c(Nc3cc(ccc3NC2=O)C(C)(C)C(=O)Nc2ccc(cc2)N2CCOCC2)c1
Show InChI InChI=1S/C34H35N5O4/c1-34(2,33(41)36-24-7-9-25(10-8-24)39-14-16-43-17-15-39)23-6-13-28-30(20-23)37-29-18-21(4-11-26(29)32(40)38-28)22-5-12-27(35)31(19-22)42-3/h4-13,18-20,37H,14-17,35H2,1-3H3,(H,36,41)(H,38,40)
Reactome pathway
n/an/an/an/a>1.00E+4n/an/an/an/a
Abbott Laboratories
Curated by ChEMBL
Assay Description
Cell cycle arrest in HeLa cells assessed as accumulation at G2/M phase by FACS assay
J Med Chem 50: 4162-76 (2007)
Article DOI: 10.1021/jm070105d
BindingDB Entry DOI: 10.7270/Q22J6BKS