BDBM50218716 3-(2-methoxy-phenyl)-5,10-dihydro-dibenzo[b,e][1,4]diazepin-11-one::CHEMBL395037
SMILES: COc1ccccc1-c1ccc2c(Nc3ccccc3NC2=O)c1
InChI Key: InChIKey=MHDMXYGPUMGAAS-UHFFFAOYSA-N
Data: 1 IC50
Activity Spreadsheet -- Enzyme Inhibition Constant Data from BindingDB
Found 1 hit for monomerid = 50218716
Trg + Lig
Ki
nM
ΔG°
kcal/mole
IC50
nM
Kd
nM
EC50/IC50
nM
koff
s-1
kon
M-1s-1
pHTemp
°C
Serine/threonine-protein kinase Chk1
(Homo sapiens (Human))
BDBM50218716
(3-(2-methoxy-phenyl)-5,10-dihydro-dibenzo[b,e][1,4...)
Show SMILES COc1ccccc1-c1ccc2c(Nc3ccccc3NC2=O)c1
Show InChI InChI=1S/C20H16N2O2/c1-24-19-9-5-2-6-14(19)13-10-11-15-18(12-13)21-16-7-3-4-8-17(16)22-20(15)23/h2-12,21H,1H3,(H,22,23)
Reactome pathway
n/an/a 3.60E+3n/an/an/an/an/an/a
Abbott Laboratories
Curated by ChEMBL
Assay Description
Inhibition of human recombinant Chk1
J Med Chem 50: 4162-76 (2007)
Article DOI: 10.1021/jm070105d
BindingDB Entry DOI: 10.7270/Q22J6BKS