BDBM50218725 3-(2-acetyl-phenyl)-5,10-dihydro-dibenzo[b,e][1,4]diazepin-11-one::CHEMBL230549
SMILES: CC(=O)c1ccccc1-c1ccc2c(Nc3ccccc3NC2=O)c1
InChI Key: InChIKey=LCDVANUUMNBGML-UHFFFAOYSA-N
Data: 1 IC50
Activity Spreadsheet -- Enzyme Inhibition Constant Data from BindingDB
Found 1 hit for monomerid = 50218725
Trg + Lig
Ki
nM
ΔG°
kcal/mole
IC50
nM
Kd
nM
EC50/IC50
nM
koff
s-1
kon
M-1s-1
pHTemp
°C
Serine/threonine-protein kinase Chk1
(Homo sapiens (Human))
BDBM50218725
(3-(2-acetyl-phenyl)-5,10-dihydro-dibenzo[b,e][1,4]...)
Show SMILES CC(=O)c1ccccc1-c1ccc2c(Nc3ccccc3NC2=O)c1
Show InChI InChI=1S/C21H16N2O2/c1-13(24)15-6-2-3-7-16(15)14-10-11-17-20(12-14)22-18-8-4-5-9-19(18)23-21(17)25/h2-12,22H,1H3,(H,23,25)
Reactome pathway
n/an/a 8.00E+3n/an/an/an/an/an/a
Abbott Laboratories
Curated by ChEMBL
Assay Description
Inhibition of human recombinant Chk1
J Med Chem 50: 4162-76 (2007)
Article DOI: 10.1021/jm070105d
BindingDB Entry DOI: 10.7270/Q22J6BKS
3D
3D Structure (docked)