BDBM50218853 CHEMBL89858::SR-10
SMILES: O=C1C=CC2(Oc3cccc4cccc(O2)c34)c2cccc(OCc3ccoc3)c12
InChI Key: InChIKey=AEWRQXSVGWKDPA-UHFFFAOYSA-N
Data: 2 IC50
Activity Spreadsheet -- Enzyme Inhibition Constant Data from BindingDB
Found 2 hits for monomerid = 50218853
Trg + Lig
Ki
nM
ΔG°
kcal/mole
IC50
nM
Kd
nM
EC50/IC50
nM
koff
s-1
kon
M-1s-1
pHTemp
°C
Thioredoxin reductase 3
(Homo sapiens (Human))
BDBM50218853
(CHEMBL89858 | SR-10)
Show SMILES O=C1C=CC2(Oc3cccc4cccc(O2)c34)c2cccc(OCc3ccoc3)c12 |c:2|
Show InChI InChI=1S/C25H16O5/c26-19-10-12-25(29-21-8-1-4-17-5-2-9-22(30-25)23(17)21)18-6-3-7-20(24(18)19)28-15-16-11-13-27-14-16/h1-14H,15H2
n/an/a>5.00E+4n/an/an/an/an/an/a
University of Pittsburgh
Curated by ChEMBL
Assay Description
Inhibition of thioredoxin reductase
Bioorg Med Chem Lett 11: 2637-41 (2001)
BindingDB Entry DOI: 10.7270/Q22R3TTN
Thioredoxin reductase 3
(Homo sapiens (Human))
BDBM50218853
(CHEMBL89858 | SR-10)
Show SMILES O=C1C=CC2(Oc3cccc4cccc(O2)c34)c2cccc(OCc3ccoc3)c12 |c:2|
Show InChI InChI=1S/C25H16O5/c26-19-10-12-25(29-21-8-1-4-17-5-2-9-22(30-25)23(17)21)18-6-3-7-20(24(18)19)28-15-16-11-13-27-14-16/h1-14H,15H2
n/an/a 2.32E+4n/an/an/an/an/an/a
University of Pittsburgh
Curated by ChEMBL
Assay Description
Inhibition of thioredoxin-1/thioredoxin reductase system
Bioorg Med Chem Lett 11: 2637-41 (2001)
BindingDB Entry DOI: 10.7270/Q22R3TTN