BDBM50218865 CHEMBL328520
SMILES: C\C=C(/C)COc1cccc2c1C(=O)C=CC21Oc2cccc3cccc(O1)c23
InChI Key: InChIKey=XNTZPZCWQSHMNB-HQYXKAPLSA-N
Data: 1 IC50
Activity Spreadsheet -- Enzyme Inhibition Constant Data from BindingDB
Found 1 hit for monomerid = 50218865
Trg + Lig
Ki
nM
ΔG°
kcal/mole
IC50
nM
Kd
nM
EC50/IC50
nM
koff
s-1
kon
M-1s-1
pHTemp
°C
Thioredoxin reductase 3
(Homo sapiens (Human))
BDBM50218865
(CHEMBL328520)
Show SMILES C\C=C(/C)COc1cccc2c1C(=O)C=CC21Oc2cccc3cccc(O1)c23 |c:15|
Show InChI InChI=1S/C25H20O4/c1-3-16(2)15-27-20-10-6-9-18-24(20)19(26)13-14-25(18)28-21-11-4-7-17-8-5-12-22(29-25)23(17)21/h3-14H,15H2,1-2H3/b16-3+
n/an/a>5.00E+4n/an/an/an/an/an/a
University of Pittsburgh
Curated by ChEMBL
Assay Description
Inhibition of thioredoxin-1/thioredoxin reductase system
Bioorg Med Chem Lett 11: 2637-41 (2001)
BindingDB Entry DOI: 10.7270/Q22R3TTN