BDBM50218934 CHEMBL395017::sodium (8S,9R)-10(E)-ethylidene-4(S)-(2'-fluoroethoxy)-11-oxo-1-azatricyclo[7.2.0.03, 8]undec-2-enecarboxylate
SMILES: C\C=C1/[C@H]2[C@H]3CCC[C@H](OCCF)C3=C(N2C1=O)C([O-])=O
InChI Key: InChIKey=OVEFSUBTHUNTRK-JCKKZLPESA-M
Data: 3 IC50
Activity Spreadsheet -- Enzyme Inhibition Constant Data from BindingDB
Found 3 hits for monomerid = 50218934
Trg + Lig
Ki
nM
ΔG°
kcal/mole
IC50
nM
Kd
nM
EC50/IC50
nM
koff
s-1
kon
M-1s-1
pHTemp
°C
Beta-lactamase (TEM-1)
(Escherichia coli)
BDBM50218934
(CHEMBL395017 | sodium (8S,9R)-10(E)-ethylidene-4(S...)
Show SMILES C\C=C1/[C@H]2[C@H]3CCC[C@H](OCCF)C3=C(N2C1=O)C([O-])=O |c:14|
Show InChI InChI=1S/C15H18FNO4/c1-2-8-12-9-4-3-5-10(21-7-6-16)11(9)13(15(19)20)17(12)14(8)18/h2,9-10,12H,3-7H2,1H3,(H,19,20)/p-1/b8-2+/t9-,10-,12-/m0/s1
n/an/a 21n/an/an/an/an/an/a
Lek Pharmaceuticals d.d.
Curated by ChEMBL
Assay Description
Inhibition of Escherichia coli TEM1
J Med Chem 50: 4113-21 (2007)
Article DOI: 10.1021/jm0703237
BindingDB Entry DOI: 10.7270/Q2FF3T5F
Beta-lactamase
(Enterobacter cloacae)
BDBM50218934
(CHEMBL395017 | sodium (8S,9R)-10(E)-ethylidene-4(S...)
Show SMILES C\C=C1/[C@H]2[C@H]3CCC[C@H](OCCF)C3=C(N2C1=O)C([O-])=O |c:14|
Show InChI InChI=1S/C15H18FNO4/c1-2-8-12-9-4-3-5-10(21-7-6-16)11(9)13(15(19)20)17(12)14(8)18/h2,9-10,12H,3-7H2,1H3,(H,19,20)/p-1/b8-2+/t9-,10-,12-/m0/s1
n/an/a 1.02E+3n/an/an/an/an/an/a
Lek Pharmaceuticals d.d.
Curated by ChEMBL
Assay Description
Inhibition of Enterobacter cloacae AmpC
J Med Chem 50: 4113-21 (2007)
Article DOI: 10.1021/jm0703237
BindingDB Entry DOI: 10.7270/Q2FF3T5F
SHV-1 beta-lactamase
(Klebsiella pneumoniae (Enterobacteria))
BDBM50218934
(CHEMBL395017 | sodium (8S,9R)-10(E)-ethylidene-4(S...)
Show SMILES C\C=C1/[C@H]2[C@H]3CCC[C@H](OCCF)C3=C(N2C1=O)C([O-])=O |c:14|
Show InChI InChI=1S/C15H18FNO4/c1-2-8-12-9-4-3-5-10(21-7-6-16)11(9)13(15(19)20)17(12)14(8)18/h2,9-10,12H,3-7H2,1H3,(H,19,20)/p-1/b8-2+/t9-,10-,12-/m0/s1
n/an/a 148n/an/an/an/an/an/a
Lek Pharmaceuticals d.d.
Curated by ChEMBL
Assay Description
Inhibition of Escherichia coli SHV1
J Med Chem 50: 4113-21 (2007)
Article DOI: 10.1021/jm0703237
BindingDB Entry DOI: 10.7270/Q2FF3T5F