BDBM50218935 CHEMBL396509::sodium (8S,9R)-10(E)-ethylidene-4(S)-methoxy-11-oxo-1-azatricyclo[7.2.0.03,8]undec -2-enecarboxylate
SMILES: CO[C@H]1CCC[C@@H]2[C@H]3N(C(=O)\C3=C\C)C(C([O-])=O)=C12
InChI Key: InChIKey=ACQFJWSLWQLLIA-PLWQYUFKSA-M
Data: 3 IC50
Activity Spreadsheet -- Enzyme Inhibition Constant Data from BindingDB
Found 3 hits for monomerid = 50218935
Trg + Lig
Ki
nM
ΔG°
kcal/mole
IC50
nM
Kd
nM
EC50/IC50
nM
koff
s-1
kon
M-1s-1
pHTemp
°C
SHV-1 beta-lactamase
(Klebsiella pneumoniae (Enterobacteria))
BDBM50218935
(CHEMBL396509 | sodium (8S,9R)-10(E)-ethylidene-4(S...)
Show SMILES CO[C@H]1CCC[C@@H]2[C@H]3N(C(=O)\C3=C\C)C(C([O-])=O)=C12 |t:18|
Show InChI InChI=1S/C14H17NO4/c1-3-7-11-8-5-4-6-9(19-2)10(8)12(14(17)18)15(11)13(7)16/h3,8-9,11H,4-6H2,1-2H3,(H,17,18)/p-1/b7-3+/t8-,9-,11-/m0/s1
n/an/a 151n/an/an/an/an/an/a
Lek Pharmaceuticals d.d.
Curated by ChEMBL
Assay Description
Inhibition of Escherichia coli SHV1
J Med Chem 50: 4113-21 (2007)
Article DOI: 10.1021/jm0703237
BindingDB Entry DOI: 10.7270/Q2FF3T5F
Beta-lactamase
(Enterobacter cloacae)
BDBM50218935
(CHEMBL396509 | sodium (8S,9R)-10(E)-ethylidene-4(S...)
Show SMILES CO[C@H]1CCC[C@@H]2[C@H]3N(C(=O)\C3=C\C)C(C([O-])=O)=C12 |t:18|
Show InChI InChI=1S/C14H17NO4/c1-3-7-11-8-5-4-6-9(19-2)10(8)12(14(17)18)15(11)13(7)16/h3,8-9,11H,4-6H2,1-2H3,(H,17,18)/p-1/b7-3+/t8-,9-,11-/m0/s1
n/an/a 62n/an/an/an/an/an/a
Lek Pharmaceuticals d.d.
Curated by ChEMBL
Assay Description
Inhibition of Enterobacter cloacae AmpC
J Med Chem 50: 4113-21 (2007)
Article DOI: 10.1021/jm0703237
BindingDB Entry DOI: 10.7270/Q2FF3T5F
Beta-lactamase (TEM-1)
(Escherichia coli)
BDBM50218935
(CHEMBL396509 | sodium (8S,9R)-10(E)-ethylidene-4(S...)
Show SMILES CO[C@H]1CCC[C@@H]2[C@H]3N(C(=O)\C3=C\C)C(C([O-])=O)=C12 |t:18|
Show InChI InChI=1S/C14H17NO4/c1-3-7-11-8-5-4-6-9(19-2)10(8)12(14(17)18)15(11)13(7)16/h3,8-9,11H,4-6H2,1-2H3,(H,17,18)/p-1/b7-3+/t8-,9-,11-/m0/s1
n/an/a 55n/an/an/an/an/an/a
Lek Pharmaceuticals d.d.
Curated by ChEMBL
Assay Description
Inhibition of Escherichia coli TEM1
J Med Chem 50: 4113-21 (2007)
Article DOI: 10.1021/jm0703237
BindingDB Entry DOI: 10.7270/Q2FF3T5F