BDBM50219034 CHEMBL243129::N-{3-[1-(6-diphenylacetylamino-hexyl)-piperidin-4-yl]-phenyl-isobutyramide
SMILES: CC(C)C(=O)Nc1cccc(c1)C1CCN(CCCCCCNC(=O)C(c2ccccc2)c2ccccc2)CC1
InChI Key: InChIKey=OCZOHPQRIJVMGG-UHFFFAOYSA-N
Data: 1 KI  1 IC50
Activity Spreadsheet -- Enzyme Inhibition Constant Data from BindingDB
Found 2 hits for monomerid = 50219034
Trg + Lig
Ki
nM
ΔG°
kcal/mole
IC50
nM
Kd
nM
EC50/IC50
nM
koff
s-1
kon
M-1s-1
pHTemp
°C
GPR24
(RAT)
BDBM50219034
(CHEMBL243129 | N-{3-[1-(6-diphenylacetylamino-hexy...)
Show SMILES CC(C)C(=O)Nc1cccc(c1)C1CCN(CCCCCCNC(=O)C(c2ccccc2)c2ccccc2)CC1
Show InChI InChI=1S/C35H45N3O2/c1-27(2)34(39)37-32-19-13-18-31(26-32)28-20-24-38(25-21-28)23-12-4-3-11-22-36-35(40)33(29-14-7-5-8-15-29)30-16-9-6-10-17-30/h5-10,13-19,26-28,33H,3-4,11-12,20-25H2,1-2H3,(H,36,40)(H,37,39)
Reactome pathway
29n/an/an/an/an/an/an/an/a
Lundbeck Research USA, Inc.
Curated by ChEMBL
Assay Description
Displacement of [3H]SNAP 7941 from rat MCHR1 expressed in HEK293 cells
J Med Chem 50: 3870-82 (2007)
Article DOI: 10.1021/jm060381c
BindingDB Entry DOI: 10.7270/Q2930SWM
GPR24
(RAT)
BDBM50219034
(CHEMBL243129 | N-{3-[1-(6-diphenylacetylamino-hexy...)
Show SMILES CC(C)C(=O)Nc1cccc(c1)C1CCN(CCCCCCNC(=O)C(c2ccccc2)c2ccccc2)CC1
Show InChI InChI=1S/C35H45N3O2/c1-27(2)34(39)37-32-19-13-18-31(26-32)28-20-24-38(25-21-28)23-12-4-3-11-22-36-35(40)33(29-14-7-5-8-15-29)30-16-9-6-10-17-30/h5-10,13-19,26-28,33H,3-4,11-12,20-25H2,1-2H3,(H,36,40)(H,37,39)
Reactome pathway
n/an/a 600n/an/an/an/an/an/a
Lundbeck Research USA, Inc.
Curated by ChEMBL
Assay Description
Antagonist activity at rat MCHR1 expressed in HEK293 cells assessed as effect on calcium mobilization
J Med Chem 50: 3870-82 (2007)
Article DOI: 10.1021/jm060381c
BindingDB Entry DOI: 10.7270/Q2930SWM