BDBM50219457 4-(4-(5-fluoro-2-methoxyphenyl)-2-hydroxy-4-methyl-2-(trifluoromethyl)pentyl)-2,6-dimethylbenzonitrile::CHEMBL236755
SMILES: COc1ccc(F)cc1C(C)(C)CC(O)(Cc1cc(C)c(C#N)c(C)c1)C(F)(F)F
InChI Key: InChIKey=ALDWINSGSURGLP-UHFFFAOYSA-N
Data: 3 IC50
Activity Spreadsheet -- Enzyme Inhibition Constant Data from BindingDB
Found 3 hits for monomerid = 50219457
Trg + Lig
Ki
nM
ΔG°
kcal/mole
IC50
nM
Kd
nM
EC50/IC50
nM
koff
s-1
kon
M-1s-1
pHTemp
°C
Mineralocorticoid receptor
(Homo sapiens (Human))
BDBM50219457
(4-(4-(5-fluoro-2-methoxyphenyl)-2-hydroxy-4-methyl...)
Show SMILES COc1ccc(F)cc1C(C)(C)CC(O)(Cc1cc(C)c(C#N)c(C)c1)C(F)(F)F |w:13.14|
Show InChI InChI=1S/C23H25F4NO2/c1-14-8-16(9-15(2)18(14)12-28)11-22(29,23(25,26)27)13-21(3,4)19-10-17(24)6-7-20(19)30-5/h6-10,29H,11,13H2,1-5H3
n/an/a 300n/an/an/an/an/an/a
Boehringer Ingelheim Pharmaceuticals Inc.
Curated by ChEMBL
Assay Description
Displacement of TAMRA labeled mifepristone at human mineralocorticoid receptor in insect cell
Bioorg Med Chem Lett 17: 5025-31 (2007)
Article DOI: 10.1016/j.bmcl.2007.07.031
BindingDB Entry DOI: 10.7270/Q2G73FJ2
Glucocorticoid receptor
(Homo sapiens (Human))
BDBM50219457
(4-(4-(5-fluoro-2-methoxyphenyl)-2-hydroxy-4-methyl...)
Show SMILES COc1ccc(F)cc1C(C)(C)CC(O)(Cc1cc(C)c(C#N)c(C)c1)C(F)(F)F |w:13.14|
Show InChI InChI=1S/C23H25F4NO2/c1-14-8-16(9-15(2)18(14)12-28)11-22(29,23(25,26)27)13-21(3,4)19-10-17(24)6-7-20(19)30-5/h6-10,29H,11,13H2,1-5H3
n/an/a 11n/an/an/an/an/an/a
Boehringer Ingelheim Pharmaceuticals Inc.
Curated by ChEMBL
Assay Description
Displacement of TAMRA labeled Dexamethasone at human glucocorticoid receptor in insect cell
Bioorg Med Chem Lett 17: 5025-31 (2007)
Article DOI: 10.1016/j.bmcl.2007.07.031
BindingDB Entry DOI: 10.7270/Q2G73FJ2
Progesterone receptor
(Homo sapiens (Human))
BDBM50219457
(4-(4-(5-fluoro-2-methoxyphenyl)-2-hydroxy-4-methyl...)
Show SMILES COc1ccc(F)cc1C(C)(C)CC(O)(Cc1cc(C)c(C#N)c(C)c1)C(F)(F)F |w:13.14|
Show InChI InChI=1S/C23H25F4NO2/c1-14-8-16(9-15(2)18(14)12-28)11-22(29,23(25,26)27)13-21(3,4)19-10-17(24)6-7-20(19)30-5/h6-10,29H,11,13H2,1-5H3
n/an/a 390n/an/an/an/an/an/a
Boehringer Ingelheim Pharmaceuticals Inc.
Curated by ChEMBL
Assay Description
Displacement of TAMRA labeled Dexamethasone at human progesterone receptor in insect cell
Bioorg Med Chem Lett 17: 5025-31 (2007)
Article DOI: 10.1016/j.bmcl.2007.07.031
BindingDB Entry DOI: 10.7270/Q2G73FJ2