BDBM50220007 CHEMBL58264
SMILES: [#8]-[#6](=O)C(F)(F)F.[H][C@]1([#8]-[#6](=[#6]-[#6@H](\[#7]=[#6](/[#7])-[#7])-[#6@H]1-[#7]-[#6](-[#6])=O)-[#6](-[#8])=O)[#6@H](-[#8]-[#6]-[#6]-[#6]-[#6]-[#6]-[#6]-[#6]-[#6])-[#6@H](-[#8])-[#6]-[#8]
InChI Key: InChIKey=GAEDSJMECGQJNI-QBBQCFRVSA-N
Data: 1 IC50
Activity Spreadsheet -- Enzyme Inhibition Constant Data from BindingDB
Found 1 hit for monomerid = 50220007
Trg + Lig
Ki
nM
ΔG°
kcal/mole
IC50
nM
Kd
nM
EC50/IC50
nM
koff
s-1
kon
M-1s-1
pHTemp
°C
Neuraminidase
(Influenza A virus (A/Puerto Rico/8/34/Mount Sinai(...)
BDBM50220007
(CHEMBL58264)
Show SMILES [#8]-[#6](=O)C(F)(F)F.[H][C@]1([#8]-[#6](=[#6]-[#6@H](\[#7]=[#6](/[#7])-[#7])-[#6@H]1-[#7]-[#6](-[#6])=O)-[#6](-[#8])=O)[#6@H](-[#8]-[#6]-[#6]-[#6]-[#6]-[#6]-[#6]-[#6]-[#6])-[#6@H](-[#8])-[#6]-[#8] |c:9|
Show InChI InChI=1S/C20H36N4O7/c1-3-4-5-6-7-8-9-30-17(14(27)11-25)18-16(23-12(2)26)13(24-20(21)22)10-15(31-18)19(28)29/h10,13-14,16-18,25,27H,3-9,11H2,1-2H3,(H,23,26)(H,28,29)(H4,21,22,24)/t13-,14+,16+,17+,18+/m0/s1
n/an/a 20n/an/an/an/an/an/a
Sankyo Co., Ltd.
Curated by ChEMBL
Assay Description
Inhibition of influenza A sialidase in vitro.
Bioorg Med Chem Lett 12: 1925-8 (2002)
BindingDB Entry DOI: 10.7270/Q2RB76SB