BDBM50220172 4'-(trifluoromethyl)-4-biphenylyl sulfamate::CHEMBL396794
SMILES: NS(=O)(=O)Oc1ccc(cc1)-c1ccc(cc1)C(F)(F)F
InChI Key: InChIKey=CRJUOWWINLUIRE-UHFFFAOYSA-N
Data: 1 IC50
Activity Spreadsheet -- Enzyme Inhibition Constant Data from BindingDB
Found 1 hit for monomerid = 50220172
Trg + Lig
Ki
nM
ΔG°
kcal/mole
IC50
nM
Kd
nM
EC50/IC50
nM
koff
s-1
kon
M-1s-1
pHTemp
°C
Kinesin-like protein 1
(Homo sapiens (Human))
BDBM50220172
(4'-(trifluoromethyl)-4-biphenylyl sulfamate | CHEM...)
Show SMILES NS(=O)(=O)Oc1ccc(cc1)-c1ccc(cc1)C(F)(F)F
Show InChI InChI=1S/C13H10F3NO3S/c14-13(15,16)11-5-1-9(2-6-11)10-3-7-12(8-4-10)20-21(17,18)19/h1-8H,(H2,17,18,19)
Reactome pathway
n/an/a 64n/an/an/an/an/an/a
GlaxoSmithKline
Curated by ChEMBL
Assay Description
Inhibition of human KSP motor domain by ATPase assay
J Med Chem 50: 4939-52 (2007)
Article DOI: 10.1021/jm070435y
BindingDB Entry DOI: 10.7270/Q29023H4