BDBM50220573 1-(1-(3-chloro-4-hydroxyphenyl)-1-hydroxypropan-2-yl)-4-(4-fluorophenyl)piperidin-4-ol::CHEMBL401406
SMILES: CC(C(O)c1ccc(O)c(Cl)c1)N1CCC(O)(CC1)c1ccc(F)cc1
InChI Key: InChIKey=NXKIHQUDEGCERT-UHFFFAOYSA-N
Data: 2 IC50
Activity Spreadsheet -- Enzyme Inhibition Constant Data from BindingDB
Found 2 hits for monomerid = 50220573
Trg + Lig
Ki
nM
ΔG°
kcal/mole
IC50
nM
Kd
nM
EC50/IC50
nM
koff
s-1
kon
M-1s-1
pHTemp
°C
Cytochrome P450 2D6
(Homo sapiens (Human))
BDBM50220573
(1-(1-(3-chloro-4-hydroxyphenyl)-1-hydroxypropan-2-...)
Show SMILES CC(C(O)c1ccc(O)c(Cl)c1)N1CCC(O)(CC1)c1ccc(F)cc1 |w:1.0,2.2|
Show InChI InChI=1S/C20H23ClFNO3/c1-13(19(25)14-2-7-18(24)17(21)12-14)23-10-8-20(26,9-11-23)15-3-5-16(22)6-4-15/h2-7,12-13,19,24-26H,8-11H2,1H3
n/an/a 3.50E+3n/an/an/an/an/an/a
Pfizer Global Research & Development
Curated by ChEMBL
Assay Description
Displacement of [3H]bufuralol from CYP2D6
Bioorg Med Chem Lett 17: 5558-62 (2007)
Article DOI: 10.1016/j.bmcl.2007.08.014
BindingDB Entry DOI: 10.7270/Q2R21138
Glutamate receptor ionotropic, NMDA 2B
(Rattus norvegicus (Rat))
BDBM50220573
(1-(1-(3-chloro-4-hydroxyphenyl)-1-hydroxypropan-2-...)
Show SMILES CC(C(O)c1ccc(O)c(Cl)c1)N1CCC(O)(CC1)c1ccc(F)cc1 |w:1.0,2.2|
Show InChI InChI=1S/C20H23ClFNO3/c1-13(19(25)14-2-7-18(24)17(21)12-14)23-10-8-20(26,9-11-23)15-3-5-16(22)6-4-15/h2-7,12-13,19,24-26H,8-11H2,1H3
n/an/a 5.60n/an/an/an/an/an/a
Pfizer Global Research & Development
Curated by ChEMBL
Assay Description
Displacement of [3H]racemic CP101606 from rat NR2B receptor in P2 membrane
Bioorg Med Chem Lett 17: 5558-62 (2007)
Article DOI: 10.1016/j.bmcl.2007.08.014
BindingDB Entry DOI: 10.7270/Q2R21138