BDBM50220584 6-(2-(4-(4-fluorophenyl)-4-hydroxypiperidin-1-yl)-1-hydroxypropyl)-3,4-dihydroquinazolin-2(1H)-one::CHEMBL246815
SMILES: CC(C(O)c1ccc2NC(=O)NCc2c1)N1CCC(O)(CC1)c1ccc(F)cc1
InChI Key: InChIKey=LIIMZDKZANZWFU-UHFFFAOYSA-N
Data: 3 IC50
Activity Spreadsheet -- Enzyme Inhibition Constant Data from BindingDB
Found 3 hits for monomerid = 50220584
Trg + Lig
Ki
nM
ΔG°
kcal/mole
IC50
nM
Kd
nM
EC50/IC50
nM
koff
s-1
kon
M-1s-1
pHTemp
°C
Glutamate receptor ionotropic, NMDA 2B
(Rattus norvegicus (Rat))
BDBM50220584
(6-(2-(4-(4-fluorophenyl)-4-hydroxypiperidin-1-yl)-...)
Show SMILES CC(C(O)c1ccc2NC(=O)NCc2c1)N1CCC(O)(CC1)c1ccc(F)cc1 |w:2.2,1.0|
Show InChI InChI=1S/C22H26FN3O3/c1-14(20(27)15-2-7-19-16(12-15)13-24-21(28)25-19)26-10-8-22(29,9-11-26)17-3-5-18(23)6-4-17/h2-7,12,14,20,27,29H,8-11,13H2,1H3,(H2,24,25,28)
n/an/a 9.10n/an/an/an/an/an/a
Pfizer Global Research & Development
Curated by ChEMBL
Assay Description
Displacement of [3H]racemic CP101606 from rat NR2B receptor in P2 membrane
Bioorg Med Chem Lett 17: 5558-62 (2007)
Article DOI: 10.1016/j.bmcl.2007.08.014
BindingDB Entry DOI: 10.7270/Q2R21138
Potassium voltage-gated channel subfamily H member 2
(Homo sapiens (Human))
BDBM50220584
(6-(2-(4-(4-fluorophenyl)-4-hydroxypiperidin-1-yl)-...)
Show SMILES CC(C(O)c1ccc2NC(=O)NCc2c1)N1CCC(O)(CC1)c1ccc(F)cc1 |w:2.2,1.0|
Show InChI InChI=1S/C22H26FN3O3/c1-14(20(27)15-2-7-19-16(12-15)13-24-21(28)25-19)26-10-8-22(29,9-11-26)17-3-5-18(23)6-4-17/h2-7,12,14,20,27,29H,8-11,13H2,1H3,(H2,24,25,28)
Reactome pathway
n/an/a 7.40E+3n/an/an/an/an/an/a
Pfizer Global Research & Development
Curated by ChEMBL
Assay Description
Displacement of [3H]bufuralol from hERG channel expressed in HEK293 cells
Bioorg Med Chem Lett 17: 5558-62 (2007)
Article DOI: 10.1016/j.bmcl.2007.08.014
BindingDB Entry DOI: 10.7270/Q2R21138
Cytochrome P450 2D6
(Homo sapiens (Human))
BDBM50220584
(6-(2-(4-(4-fluorophenyl)-4-hydroxypiperidin-1-yl)-...)
Show SMILES CC(C(O)c1ccc2NC(=O)NCc2c1)N1CCC(O)(CC1)c1ccc(F)cc1 |w:2.2,1.0|
Show InChI InChI=1S/C22H26FN3O3/c1-14(20(27)15-2-7-19-16(12-15)13-24-21(28)25-19)26-10-8-22(29,9-11-26)17-3-5-18(23)6-4-17/h2-7,12,14,20,27,29H,8-11,13H2,1H3,(H2,24,25,28)
n/an/a>3.00E+4n/an/an/an/an/an/a
Pfizer Global Research & Development
Curated by ChEMBL
Assay Description
Displacement of [3H]bufuralol from CYP2D6
Bioorg Med Chem Lett 17: 5558-62 (2007)
Article DOI: 10.1016/j.bmcl.2007.08.014
BindingDB Entry DOI: 10.7270/Q2R21138