BDBM50220846 5-(1H-pyrazol-3-yl)-1H-tetrazole::CHEMBL393063
SMILES: c1cc(n[nH]1)-c1nnn[nH]1
InChI Key: InChIKey=ZKKOBFZVLCTUJW-UHFFFAOYSA-N
Data: 2 EC50
Activity Spreadsheet -- Enzyme Inhibition Constant Data from BindingDB
Found 2 hits for monomerid = 50220846
Trg + Lig
Ki
nM
ΔG°
kcal/mole
IC50
nM
Kd
nM
EC50/IC50
nM
koff
s-1
kon
M-1s-1
pHTemp
°C
Hydroxycarboxylic acid receptor 2
(Homo sapiens (Human))
BDBM50220846
(5-(1H-pyrazol-3-yl)-1H-tetrazole | CHEMBL393063)
Show SMILES c1cc(n[nH]1)-c1nnn[nH]1
Show InChI InChI=1S/C4H4N6/c1-2-5-6-3(1)4-7-9-10-8-4/h1-2H,(H,5,6)(H,7,8,9,10)
Reactome pathway
n/an/an/an/a 1.70E+4n/an/an/an/a
Arena Pharmaceuticals
Curated by ChEMBL
Assay Description
Agonist activity at human GPR109a expressed in human adipocytes assessed as decrease in intracellular cAMP level by HTRF assay
Bioorg Med Chem Lett 17: 5620-3 (2007)
Checked by Author
Article DOI: 10.1016/j.bmcl.2007.07.101
BindingDB Entry DOI: 10.7270/Q2TT4QN2
Hydroxycarboxylic acid receptor 2
(Homo sapiens (Human))
BDBM50220846
(5-(1H-pyrazol-3-yl)-1H-tetrazole | CHEMBL393063)
Show SMILES c1cc(n[nH]1)-c1nnn[nH]1
Show InChI InChI=1S/C4H4N6/c1-2-5-6-3(1)4-7-9-10-8-4/h1-2H,(H,5,6)(H,7,8,9,10)
Reactome pathway
n/an/an/an/a 1.70E+4n/an/an/an/a
Arena Pharmaceuticals
Curated by ChEMBL
Assay Description
Agonist activity at human GPR109a expressed in human adipocytes assessed as decrease in intracellular cAMP level by HTRF assay
Bioorg Med Chem Lett 17: 5620-3 (2007)
Checked by Author
Article DOI: 10.1016/j.bmcl.2007.07.101
BindingDB Entry DOI: 10.7270/Q2TT4QN2