BDBM50221036 CHEMBL315316
SMILES: Oc1c2SCCc2nn1-c1cccc(c1)C(F)(F)F
InChI Key: InChIKey=XQFODKIJLDAHQZ-UHFFFAOYSA-N
Data: 3 IC50
Activity Spreadsheet -- Enzyme Inhibition Constant Data from BindingDB
Found 3 hits for monomerid = 50221036
Trg + Lig
Ki
nM
ΔG°
kcal/mole
IC50
nM
Kd
nM
EC50/IC50
nM
koff
s-1
kon
M-1s-1
pHTemp
°C
MurC (S. aureus)
(Staphylococcus aureus (Firmicutes))
BDBM50221036
(CHEMBL315316)
Show SMILES Oc1c2SCCc2nn1-c1cccc(c1)C(F)(F)F
Show InChI InChI=1S/C12H9F3N2OS/c13-12(14,15)7-2-1-3-8(6-7)17-11(18)10-9(16-17)4-5-19-10/h1-3,6,18H,4-5H2
n/an/a>8.73E+4n/an/an/an/an/an/a
Wyeth Research
Curated by ChEMBL
Assay Description
In vitro inhibitory activity against Staphylococcus aureus UDP-N-acetylmuramoyl-L-alanine synthetase
Bioorg Med Chem Lett 13: 2591-4 (2003)
BindingDB Entry DOI: 10.7270/Q20P126D
MurB (S. aureus)
(Staphylococcus aureus (Firmicutes))
BDBM50221036
(CHEMBL315316)
Show SMILES Oc1c2SCCc2nn1-c1cccc(c1)C(F)(F)F
Show InChI InChI=1S/C12H9F3N2OS/c13-12(14,15)7-2-1-3-8(6-7)17-11(18)10-9(16-17)4-5-19-10/h1-3,6,18H,4-5H2
n/an/a 7.33E+4n/an/an/an/an/an/a
Wyeth Research
Curated by ChEMBL
Assay Description
In vitro inhibitory activity against Staphylococcus aureus UDP-N-acetylmuramate dehydrogenase
Bioorg Med Chem Lett 13: 2591-4 (2003)
BindingDB Entry DOI: 10.7270/Q20P126D
MurD (S. aureus)
(Staphylococcus aureus (Firmicutes))
BDBM50221036
(CHEMBL315316)
Show SMILES Oc1c2SCCc2nn1-c1cccc(c1)C(F)(F)F
Show InChI InChI=1S/C12H9F3N2OS/c13-12(14,15)7-2-1-3-8(6-7)17-11(18)10-9(16-17)4-5-19-10/h1-3,6,18H,4-5H2
n/an/a 6.63E+4n/an/an/an/an/an/a
Wyeth Research
Curated by ChEMBL
Assay Description
In vitro inhibitory activity against Staphylococcus aureus UDP-N-acetylmuramoyl-L-alanyl-D-glutamate synthetase
Bioorg Med Chem Lett 13: 2591-4 (2003)
BindingDB Entry DOI: 10.7270/Q20P126D