BDBM50221080 3-(6-((3R,4S)-3-amino-4-(2,4,5-trifluorophenyl)pyrrolidin-1-yl)pyrimidin-4-yl)benzonitrile::CHEMBL237342
SMILES: N[C@H]1CN(C[C@@H]1c1cc(F)c(F)cc1F)c1cc(ncn1)-c1cccc(c1)C#N
InChI Key: InChIKey=JIHFKASOSYQECO-BEFAXECRSA-N
Data: 1 IC50
Activity Spreadsheet -- Enzyme Inhibition Constant Data from BindingDB
Found 1 hit for monomerid = 50221080
Trg + Lig
Ki
nM
ΔG°
kcal/mole
IC50
nM
Kd
nM
EC50/IC50
nM
koff
s-1
kon
M-1s-1
pHTemp
°C
Dipeptidyl peptidase 4
(Homo sapiens (Human))
BDBM50221080
(3-(6-((3R,4S)-3-amino-4-(2,4,5-trifluorophenyl)pyr...)
Show SMILES N[C@H]1CN(C[C@@H]1c1cc(F)c(F)cc1F)c1cc(ncn1)-c1cccc(c1)C#N
Show InChI InChI=1S/C21H16F3N5/c22-16-6-18(24)17(23)5-14(16)15-9-29(10-19(15)26)21-7-20(27-11-28-21)13-3-1-2-12(4-13)8-25/h1-7,11,15,19H,9-10,26H2/t15-,19+/m1/s1
Reactome pathway
n/an/a 37n/an/an/an/an/an/a
Pfizer Global Research and Development
Curated by ChEMBL
Assay Description
Inhibition of human recombinant DPP4
Bioorg Med Chem Lett 17: 5638-42 (2007)
Article DOI: 10.1016/j.bmcl.2007.07.081
BindingDB Entry DOI: 10.7270/Q2319WRX