BDBM50221088 (3R,4S)-1-(6-(2-fluorophenyl)pyrimidin-4-yl)-4-(2,4,5-trifluorophenyl)pyrrolidin-3-amine::CHEMBL391048
SMILES: N[C@H]1CN(C[C@@H]1c1cc(F)c(F)cc1F)c1cc(ncn1)-c1ccccc1F
InChI Key: InChIKey=OLTMLWNZLFHZKA-ACJLOTCBSA-N
Data: 1 IC50
Activity Spreadsheet -- Enzyme Inhibition Constant Data from BindingDB
Found 1 hit for monomerid = 50221088
Trg + Lig
Ki
nM
ΔG°
kcal/mole
IC50
nM
Kd
nM
EC50/IC50
nM
koff
s-1
kon
M-1s-1
pHTemp
°C
Dipeptidyl peptidase 4
(Homo sapiens (Human))
BDBM50221088
((3R,4S)-1-(6-(2-fluorophenyl)pyrimidin-4-yl)-4-(2,...)
Show SMILES N[C@H]1CN(C[C@@H]1c1cc(F)c(F)cc1F)c1cc(ncn1)-c1ccccc1F
Show InChI InChI=1S/C20H16F4N4/c21-14-4-2-1-3-11(14)19-7-20(27-10-26-19)28-8-13(18(25)9-28)12-5-16(23)17(24)6-15(12)22/h1-7,10,13,18H,8-9,25H2/t13-,18+/m1/s1
Reactome pathway
n/an/a 57n/an/an/an/an/an/a
Pfizer Global Research and Development
Curated by ChEMBL
Assay Description
Inhibition of human recombinant DPP4
Bioorg Med Chem Lett 17: 5638-42 (2007)
Article DOI: 10.1016/j.bmcl.2007.07.081
BindingDB Entry DOI: 10.7270/Q2319WRX