BDBM50221223 1-(4-(5-chloro-2-methyl-1H-indol-3-yl)piperidin-1-yl)-3-(5-(methylsulfonyl)-3-(4-(trifluoromethyl)phenyl)-4,5,6,7-tetrahydropyrazolo[4,3-c]pyridin-1-yl)propan-2-ol::CHEMBL397815
SMILES: Cc1[nH]c2ccc(Cl)cc2c1C1CCN(CC(O)Cn2nc(c3CN(CCc23)S(C)(=O)=O)-c2ccc(cc2)C(F)(F)F)CC1
InChI Key: InChIKey=BPSAQZFVPPBVMN-UHFFFAOYSA-N
Data: 1 IC50
Activity Spreadsheet -- Enzyme Inhibition Constant Data from BindingDB
Found 1 hit for monomerid = 50221223
Trg + Lig
Ki
nM
ΔG°
kcal/mole
IC50
nM
Kd
nM
EC50/IC50
nM
koff
s-1
kon
M-1s-1
pHTemp
°C
Cathepsin S
(Homo sapiens (Human))
BDBM50221223
(1-(4-(5-chloro-2-methyl-1H-indol-3-yl)piperidin-1-...)
Show SMILES Cc1[nH]c2ccc(Cl)cc2c1C1CCN(CC(O)Cn2nc(c3CN(CCc23)S(C)(=O)=O)-c2ccc(cc2)C(F)(F)F)CC1 |w:16.18|
Show InChI InChI=1S/C31H35ClF3N5O3S/c1-19-29(25-15-23(32)7-8-27(25)36-19)20-9-12-38(13-10-20)16-24(41)17-40-28-11-14-39(44(2,42)43)18-26(28)30(37-40)21-3-5-22(6-4-21)31(33,34)35/h3-8,15,20,24,36,41H,9-14,16-18H2,1-2H3
Reactome pathway
n/an/a 37n/an/an/an/an/an/a
Johnson & Johnson Pharmaceutical Research & Development
Curated by ChEMBL
Assay Description
Inhibition of human cathepsin S
Bioorg Med Chem Lett 17: 5525-8 (2007)
Article DOI: 10.1016/j.bmcl.2007.08.038
BindingDB Entry DOI: 10.7270/Q2ST7PKK