BDBM50221241 1-(4-(6-chloro-1H-indol-3-yl)piperidin-1-yl)-3-(5-(methylsulfonyl)-3-(4-(trifluoromethyl)phenyl)-4,5,6,7-tetrahydropyrazolo[4,3-c]pyridin-1-yl)propan-2-ol::CHEMBL445157
SMILES: CS(=O)(=O)N1CCc2c(C1)c(nn2CC(O)CN1CCC(CC1)c1c[nH]c2cc(Cl)ccc12)-c1ccc(cc1)C(F)(F)F
InChI Key: InChIKey=CBAHBYVRCZJSCQ-UHFFFAOYSA-N
Data: 1 IC50
Activity Spreadsheet -- Enzyme Inhibition Constant Data from BindingDB
Found 1 hit for monomerid = 50221241
Trg + Lig
Ki
nM
ΔG°
kcal/mole
IC50
nM
Kd
nM
EC50/IC50
nM
koff
s-1
kon
M-1s-1
pHTemp
°C
Cathepsin S
(Homo sapiens (Human))
BDBM50221241
(1-(4-(6-chloro-1H-indol-3-yl)piperidin-1-yl)-3-(5-...)
Show SMILES CS(=O)(=O)N1CCc2c(C1)c(nn2CC(O)CN1CCC(CC1)c1c[nH]c2cc(Cl)ccc12)-c1ccc(cc1)C(F)(F)F |w:14.16|
Show InChI InChI=1S/C30H33ClF3N5O3S/c1-43(41,42)38-13-10-28-26(18-38)29(20-2-4-21(5-3-20)30(32,33)34)36-39(28)17-23(40)16-37-11-8-19(9-12-37)25-15-35-27-14-22(31)6-7-24(25)27/h2-7,14-15,19,23,35,40H,8-13,16-18H2,1H3
Reactome pathway
n/an/a 29n/an/an/an/an/an/a
Johnson & Johnson Pharmaceutical Research & Development
Curated by ChEMBL
Assay Description
Inhibition of human cathepsin S
Bioorg Med Chem Lett 17: 5525-8 (2007)
Article DOI: 10.1016/j.bmcl.2007.08.038
BindingDB Entry DOI: 10.7270/Q2ST7PKK