BDBM50221353 4-(4-(6-methoxynaphthalen-2-yl)-2-(4-(methylsulfonyl)phenyl)-1H-imidazol-5-yl)pyridine::CHEMBL391890
SMILES: COc1ccc2cc(ccc2c1)-c1[nH]c(nc1-c1ccncc1)-c1ccc(cc1)S(C)(=O)=O
InChI Key: InChIKey=KOVZYHXVGPUREJ-UHFFFAOYSA-N
Data: 1 IC50
Activity Spreadsheet -- Enzyme Inhibition Constant Data from BindingDB
Found 1 hit for monomerid = 50221353
Trg + Lig
Ki
nM
ΔG°
kcal/mole
IC50
nM
Kd
nM
EC50/IC50
nM
koff
s-1
kon
M-1s-1
pHTemp
°C
Angiopoietin-1 receptor
(Homo sapiens (Human))
BDBM50221353
(4-(4-(6-methoxynaphthalen-2-yl)-2-(4-(methylsulfon...)
Show SMILES COc1ccc2cc(ccc2c1)-c1[nH]c(nc1-c1ccncc1)-c1ccc(cc1)S(C)(=O)=O
Show InChI InChI=1S/C26H21N3O3S/c1-32-22-8-5-19-15-21(4-3-20(19)16-22)25-24(17-11-13-27-14-12-17)28-26(29-25)18-6-9-23(10-7-18)33(2,30)31/h3-16H,1-2H3,(H,28,29)
n/an/a 250n/an/an/an/an/an/a
GlaxoSmithKline
Curated by ChEMBL
Assay Description
Inhibition of Tie2
Bioorg Med Chem Lett 17: 5514-7 (2007)
Article DOI: 10.1016/j.bmcl.2007.08.052
BindingDB Entry DOI: 10.7270/Q2542N96