BDBM50221449 (3R)-1-(8-((1H-imidazol-1-yl)methyl)-2-(trifluoromethyl)-5,6-dihydro-[1,2,4]triazolo[1,5-a]pyrazin-7(8H)-yl)-3-amino-4-(2,4,5-trifluorophenyl)butan-1-one::CHEMBL250147
SMILES: N[C@@H](CC(=O)N1CCn2nc(nc2C1Cn1ccnc1)C(F)(F)F)Cc1cc(F)c(F)cc1F
InChI Key: InChIKey=CKIFCELIDODOGV-ZGTOLYCTSA-N
Data: 4 IC50
Activity Spreadsheet -- Enzyme Inhibition Constant Data from BindingDB
Found 4 hits for monomerid = 50221449
Trg + Lig
Ki
nM
ΔG°
kcal/mole
IC50
nM
Kd
nM
EC50/IC50
nM
koff
s-1
kon
M-1s-1
pHTemp
°C
Dipeptidyl peptidase VIII
(Homo sapiens (Human))
BDBM50221449
((3R)-1-(8-((1H-imidazol-1-yl)methyl)-2-(trifluorom...)
Show SMILES N[C@@H](CC(=O)N1CCn2nc(nc2C1Cn1ccnc1)C(F)(F)F)Cc1cc(F)c(F)cc1F |w:13.15|
Show InChI InChI=1S/C20H19F6N7O/c21-13-8-15(23)14(22)6-11(13)5-12(27)7-17(34)32-3-4-33-18(29-19(30-33)20(24,25)26)16(32)9-31-2-1-28-10-31/h1-2,6,8,10,12,16H,3-5,7,9,27H2/t12-,16?/m1/s1
n/an/a>1.00E+5n/an/an/an/an/an/a
Merck Research Laboratories
Curated by ChEMBL
Assay Description
Inhibition of DPP8
Bioorg Med Chem Lett 17: 5934-9 (2007)
Article DOI: 10.1016/j.bmcl.2007.07.100
BindingDB Entry DOI: 10.7270/Q20C4VH0
Dipeptidyl peptidase 9
(Homo sapiens (Human))
BDBM50221449
((3R)-1-(8-((1H-imidazol-1-yl)methyl)-2-(trifluorom...)
Show SMILES N[C@@H](CC(=O)N1CCn2nc(nc2C1Cn1ccnc1)C(F)(F)F)Cc1cc(F)c(F)cc1F |w:13.15|
Show InChI InChI=1S/C20H19F6N7O/c21-13-8-15(23)14(22)6-11(13)5-12(27)7-17(34)32-3-4-33-18(29-19(30-33)20(24,25)26)16(32)9-31-2-1-28-10-31/h1-2,6,8,10,12,16H,3-5,7,9,27H2/t12-,16?/m1/s1
n/an/a 2.70E+4n/an/an/an/an/an/a
Merck Research Laboratories
Curated by ChEMBL
Assay Description
Inhibition of DPP9
Bioorg Med Chem Lett 17: 5934-9 (2007)
Article DOI: 10.1016/j.bmcl.2007.07.100
BindingDB Entry DOI: 10.7270/Q20C4VH0
Dipeptidyl peptidase 2 (DPP II)
(Homo sapiens (Human))
BDBM50221449
((3R)-1-(8-((1H-imidazol-1-yl)methyl)-2-(trifluorom...)
Show SMILES N[C@@H](CC(=O)N1CCn2nc(nc2C1Cn1ccnc1)C(F)(F)F)Cc1cc(F)c(F)cc1F |w:13.15|
Show InChI InChI=1S/C20H19F6N7O/c21-13-8-15(23)14(22)6-11(13)5-12(27)7-17(34)32-3-4-33-18(29-19(30-33)20(24,25)26)16(32)9-31-2-1-28-10-31/h1-2,6,8,10,12,16H,3-5,7,9,27H2/t12-,16?/m1/s1
n/an/a 2.60E+4n/an/an/an/an/an/a
Merck Research Laboratories
Curated by ChEMBL
Assay Description
Inhibition of QPP
Bioorg Med Chem Lett 17: 5934-9 (2007)
Article DOI: 10.1016/j.bmcl.2007.07.100
BindingDB Entry DOI: 10.7270/Q20C4VH0
Dipeptidyl peptidase 4
(Homo sapiens (Human))
BDBM50221449
((3R)-1-(8-((1H-imidazol-1-yl)methyl)-2-(trifluorom...)
Show SMILES N[C@@H](CC(=O)N1CCn2nc(nc2C1Cn1ccnc1)C(F)(F)F)Cc1cc(F)c(F)cc1F |w:13.15|
Show InChI InChI=1S/C20H19F6N7O/c21-13-8-15(23)14(22)6-11(13)5-12(27)7-17(34)32-3-4-33-18(29-19(30-33)20(24,25)26)16(32)9-31-2-1-28-10-31/h1-2,6,8,10,12,16H,3-5,7,9,27H2/t12-,16?/m1/s1
Reactome pathway
n/an/a 2n/an/an/an/an/an/a
Merck Research Laboratories
Curated by ChEMBL
Assay Description
Inhibition of DPP4
Bioorg Med Chem Lett 17: 5934-9 (2007)
Article DOI: 10.1016/j.bmcl.2007.07.100
BindingDB Entry DOI: 10.7270/Q20C4VH0