BDBM50221562 4-(7-(2-bromo-5-hydroxyphenyl)-5-methylbenzo[e][1,2,4]triazin-3-ylamino)-N-(2-(pyrrolidin-1-yl)ethyl)benzenesulfonamide::CHEMBL398279::US8481536, 540
SMILES: Cc1cc(cc2nnc(Nc3ccc(cc3)S(=O)(=O)NCCN3CCCC3)nc12)-c1cc(O)ccc1Br
InChI Key: InChIKey=AJVISBGKRJRTQV-UHFFFAOYSA-N
Data: 1 KI  1 IC50
Activity Spreadsheet -- Enzyme Inhibition Constant Data from BindingDB
Found 2 hits for monomerid = 50221562
Trg + Lig
Ki
nM
ΔG°
kcal/mole
IC50
nM
Kd
nM
EC50/IC50
nM
koff
s-1
kon
M-1s-1
pHTemp
°C
Tyrosine-protein kinase ABL1
(Homo sapiens (Human))
BDBM50221562
(4-(7-(2-bromo-5-hydroxyphenyl)-5-methylbenzo[e][1,...)
Show SMILES Cc1cc(cc2nnc(Nc3ccc(cc3)S(=O)(=O)NCCN3CCCC3)nc12)-c1cc(O)ccc1Br
Show InChI InChI=1S/C26H27BrN6O3S/c1-17-14-18(22-16-20(34)6-9-23(22)27)15-24-25(17)30-26(32-31-24)29-19-4-7-21(8-5-19)37(35,36)28-10-13-33-11-2-3-12-33/h4-9,14-16,28,34H,2-3,10-13H2,1H3,(H,29,30,32)
Reactome pathway
1n/an/an/an/an/an/an/an/a
TargeGen, Inc.
Curated by ChEMBL
Assay Description
Inhibition of Abl
Bioorg Med Chem Lett 17: 5812-8 (2007)
Article DOI: 10.1016/j.bmcl.2007.08.043
BindingDB Entry DOI: 10.7270/Q2M32VGM
Proto-oncogene tyrosine-protein kinase Src
(Homo sapiens (Human))
BDBM50221562
(4-(7-(2-bromo-5-hydroxyphenyl)-5-methylbenzo[e][1,...)
Show SMILES Cc1cc(cc2nnc(Nc3ccc(cc3)S(=O)(=O)NCCN3CCCC3)nc12)-c1cc(O)ccc1Br
Show InChI InChI=1S/C26H27BrN6O3S/c1-17-14-18(22-16-20(34)6-9-23(22)27)15-24-25(17)30-26(32-31-24)29-19-4-7-21(8-5-19)37(35,36)28-10-13-33-11-2-3-12-33/h4-9,14-16,28,34H,2-3,10-13H2,1H3,(H,29,30,32)
US Patent
n/an/a 4.10n/an/an/an/an/a25
TargeGen, Inc.
US Patent
Assay Description
Testing of inhibition of kinases in vitro using luciferase-based assay from KinaseGlo, Promega Corp.
US Patent US8481536 (2013)
BindingDB Entry DOI: 10.7270/Q2GB22PZ