BDBM50221909 2,5-bis{5-[ethyl(2-methoxybenzyl)amino]pentylamino}-[1,4]-benzoquinone::CHEMBL230702
SMILES: CCN(CCCCCNc1cc(O)c(cc1O)N=CCCCCN(CC)Cc1ccccc1OC)Cc1ccccc1OC
InChI Key: InChIKey=KDEKXAQSOSXZTB-UHFFFAOYSA-N
Data: 2 IC50
Activity Spreadsheet -- Enzyme Inhibition Constant Data from BindingDB
Found 2 hits for monomerid = 50221909
Trg + Lig
Ki
nM
ΔG°
kcal/mole
IC50
nM
Kd
nM
EC50/IC50
nM
koff
s-1
kon
M-1s-1
pHTemp
°C
Cholinesterases
(Homo sapiens (Human))
BDBM50221909
(2,5-bis{5-[ethyl(2-methoxybenzyl)amino]pentylamino...)
Show SMILES CCN(CCCCCNc1cc(O)c(cc1O)N=CCCCCN(CC)Cc1ccccc1OC)Cc1ccccc1OC |w:17.17|
Show InChI InChI=1S/C36H52N4O4/c1-5-39(27-29-17-9-11-19-35(29)43-3)23-15-7-13-21-37-31-25-34(42)32(26-33(31)41)38-22-14-8-16-24-40(6-2)28-30-18-10-12-20-36(30)44-4/h9-12,17-21,25-26,38,41-42H,5-8,13-16,22-24,27-28H2,1-4H3
Reactome pathway
n/an/a 3.46E+3n/an/an/an/an/an/a
University of Bologna
Curated by ChEMBL
Assay Description
Inhibition of human recombinant butyrylcholinesterase
J Med Chem 50: 4882-97 (2007)
Article DOI: 10.1021/jm070559a
BindingDB Entry DOI: 10.7270/Q218379R
Acetylcholinesterase
(Homo sapiens (Human))
BDBM50221909
(2,5-bis{5-[ethyl(2-methoxybenzyl)amino]pentylamino...)
Show SMILES CCN(CCCCCNc1cc(O)c(cc1O)N=CCCCCN(CC)Cc1ccccc1OC)Cc1ccccc1OC |w:17.17|
Show InChI InChI=1S/C36H52N4O4/c1-5-39(27-29-17-9-11-19-35(29)43-3)23-15-7-13-21-37-31-25-34(42)32(26-33(31)41)38-22-14-8-16-24-40(6-2)28-30-18-10-12-20-36(30)44-4/h9-12,17-21,25-26,38,41-42H,5-8,13-16,22-24,27-28H2,1-4H3
NCI pathway
Reactome pathway
n/an/a 2.40n/an/an/an/an/an/a
University of Bologna
Curated by ChEMBL
Assay Description
Inhibition of human recombinant acetylcholinesterase
J Med Chem 50: 4882-97 (2007)
Article DOI: 10.1021/jm070559a
BindingDB Entry DOI: 10.7270/Q218379R